{"text_format":"1","workbook":"xlsx","n_sheets":6,"sheets":["Diárias-2020","RELATÓRIO","CARGA - RUBRICAS","Banco de Matriculas ","REFERÊNCIA","temp"],"not_rendered":{"charts":0,"images":1,"macros":1,"external_links":0,"defined_names":1,"comments":2,"pivot_tables":0},"unopened":[],"bounds":{"document_bytes":16777216,"sheet_cells":100000,"rows_first":2000,"rows_last":500,"rows_between":2000,"halvings":0,"cell_chars":16384,"cell_head_chars":4096},"cells_cut":0,"cells_raw":0,"read":"whole","date_system":"1900"}

{"sheet":"Diárias-2020","index":0,"n_rows":513,"n_cols":25,"rows_kept":513,"cut":false,"hidden":false,"merged":[[6,4,6,23],[7,4,7,23],[8,4,8,23],[10,4,10,23]]}
[]
[]
[]
[]
[]
[]
[null,null,null,null,"TRIBUNAL REGIONAL FEDERAL "]
[null,null,null,null,"JUSTIÇA FEDERAL DO ESTADO DE MATO GROSSO "]
[null,null,null,null,"SEÇÃO DE EXECUÇÃO ORÇAMENTÁRIA E FINANCEIRA - SEOFI"]
[]
[null,null,null,null,"RELAÇÃO DE DIÁRIAS PAGAS NO PERÍODO DE 16/01/2020 ATÉ 31/01/2020 "]
[]
["Nº","MÊS","DATA","PAG/REST.","Unidade Requisitante","Matrícula","Nome do favorecido","CPF","DOC. SIAFI","PAE","Finalidade do serviço ou atividade a ser desenvolvida","Roteiro","Início do Período","Fim do Período","Meio de transporte a ser utilizado","Valor unitário","Quantidade de diárias ","Valor correspondente à eventual dedução de auxílio-alimentação, indenização de transporte e auxílio-transporte","Outras Deduções ","Valor total das diárias","Nome do ordenador de despesas","Hipóteses elencadas no § 1º do art. 10 da Resolução 340/2015 do Conselho da Justiça Federal.\n(Equipe de Trabalho)","Hipóteses elencadas no § 3º do art. 10 da Resolução 340/2015 do Conselho da Justiça Federal.\n(Servidor acompanhamento Magistrado)","Hipóteses elencadas no § 5º do art. 10 da Resolução 340/2015 do Conselho da Justiça Federal.\n(Agente de segurança acompanhando magistrado ou Desembargador Federal)","OBSERVAÇÃO"]
[1,"JANEIRO","2020-01-22","PAG.","SECAD","MT36360",{"$f":"VLOOKUP(F14,'Banco de Matriculas '!A:C,2,FALSE)","v":"RODRIGO GUSMAO ABDO"},{"$f":"VLOOKUP(F14,'Banco de Matriculas '!A:C,3,FALSE)","v":"929.607.661-72"},"AV 01","7009.13.2019","Vistoriar telhado da UAA de Tangará da Serra-MT,","Cuiabá/Tangará da Serra/Cuiabá","2020-01-15","2020-01-15","Veículo oficial",506.44,0.5,41.36,null,211.86,"Pedro Francisco da Silva","Não","Não","Não"]
[2,"JANEIRO","2020-01-28","PAG.","SECAD","MT36178",{"$f":"VLOOKUP(F15,'Banco de Matriculas '!A:C,2,FALSE)","v":"ROBSON ALBERTO OLIVEIRA DA CRUZ"},{"$f":"VLOOKUP(F15,'Banco de Matriculas '!A:C,3,FALSE)","v":"545.166.331-91"},"AV 02","329.75.2020","Vistoriar obra em Sinop-MT e fazer levantamento de reforma no prédio onde atualmente funciona a Justiça Federal","Cuiabá/Sinop/Cuiabá","2020-01-27","2020-01-31","Rodoviario",506.44,4.5,206.8,null,2445.2399999999998,"Pedro Francisco da Silva","Não","Não","Não"]
[3,"JANEIRO","2020-01-28","PAG.","SSJ DIAMANTINO","JU651",{"$f":"VLOOKUP(F16,'Banco de Matriculas '!A:C,2,FALSE)","v":"RODRIGO GASIGLIA DE SOUZA"},{"$f":"VLOOKUP(F16,'Banco de Matriculas '!A:C,3,FALSE)","v":"897.828.951-72"},"AV 03","337.52.2020","Responder pela subseção de Diamantino-MT realizando audiências presenciais","Rondonópolis/Diamantino/Rondonópolis","2020-01-29","2020-01-31","Veículo próprio",700,2.5,124.08,null,1750,"Pedro Francisco da Silva","Não","Não","Não"]
[4,"FEVEREIRO","2020-02-05","PAG.","SECAD-MT","DF1277703",{"$f":"VLOOKUP(F17,'Banco de Matriculas '!A:C,2,FALSE)","v":"JOSÉ AFONSO PIRES FERREIRA JÚNIOR"},{"$f":"VLOOKUP(F17,'Banco de Matriculas '!A:C,3,FALSE)","v":"444.020.311-68"},"AV 04","690.92.2020","Ministrar o Curso de Aposentadorias e Pensões - A Nova Previdência - EC 103/2019","Brasília/Cuiabá/Brasília","2020-02-11","2020-02-15","Aéreo",700,4.5,165.44,null,1782.89,"Pedro Francisco da Silva","Não","Não","Não"]
[5,null,null,null,null,null,{"$f":"VLOOKUP(F18,'Banco de Matriculas '!A:C,2,FALSE)","v":0},{"$f":"VLOOKUP(F18,'Banco de Matriculas '!A:C,3,FALSE)","v":0}]
[6,null,null,null,null,null,{"$f":"VLOOKUP(F19,'Banco de Matriculas '!A:C,2,FALSE)","v":0},{"$f":"VLOOKUP(F19,'Banco de Matriculas '!A:C,3,FALSE)","v":0},null,null,null,null,null,null,null,null,null,null,null,null,null,null,null,null,"Tipo de AVS - Prorrogação"]
[7,null,null,null,null,null,{"$f":"VLOOKUP(F20,'Banco de Matriculas '!A:C,2,FALSE)","v":0},{"$f":"VLOOKUP(F20,'Banco de Matriculas '!A:C,3,FALSE)","v":0},null,null,null,null,null,null,null,null,null,null,null,null,null,null,null,null,"Tipo de AVS - Prorrogação"]
[8,null,null,null,null,null,{"$f":"VLOOKUP(F21,'Banco de Matriculas '!A:C,2,FALSE)","v":0},{"$f":"VLOOKUP(F21,'Banco de Matriculas '!A:C,3,FALSE)","v":0}]
[9,null,null,null,null,null,{"$f":"VLOOKUP(F22,'Banco de Matriculas '!A:C,2,FALSE)","v":0},{"$f":"VLOOKUP(F22,'Banco de Matriculas '!A:C,3,FALSE)","v":0},null,null,null,null,null,null,null,null,null,null,null,null,null,null,null,null,"Tipo de AVS - Prorrogação"]
[10,null,null,null,null,null,{"$f":"VLOOKUP(F23,'Banco de Matriculas '!A:C,2,FALSE)","v":0},{"$f":"VLOOKUP(F23,'Banco de Matriculas '!A:C,3,FALSE)","v":0}]
[11,null,null,null,null,null,{"$f":"VLOOKUP(F24,'Banco de Matriculas '!A:C,2,FALSE)","v":0},{"$f":"VLOOKUP(F24,'Banco de Matriculas '!A:C,3,FALSE)","v":0}]
[12,null,null,null,null,null,{"$f":"VLOOKUP(F25,'Banco de Matriculas '!A:C,2,FALSE)","v":0},{"$f":"VLOOKUP(F25,'Banco de Matriculas '!A:C,3,FALSE)","v":0}]
[13,null,null,null,null,null,{"$f":"VLOOKUP(F26,'Banco de Matriculas '!A:C,2,FALSE)","v":0},{"$f":"VLOOKUP(F26,'Banco de Matriculas '!A:C,3,FALSE)","v":0}]
[14,null,null,null,null,null,{"$f":"VLOOKUP(F27,'Banco de Matriculas '!A:C,2,FALSE)","v":0},{"$f":"VLOOKUP(F27,'Banco de Matriculas '!A:C,3,FALSE)","v":0}]
[15,null,null,null,null,null,{"$f":"VLOOKUP(F28,'Banco de Matriculas '!A:C,2,FALSE)","v":0},{"$f":"VLOOKUP(F28,'Banco de Matriculas '!A:C,3,FALSE)","v":0}]
[16,null,null,null,null,null,{"$f":"VLOOKUP(F29,'Banco de Matriculas '!A:C,2,FALSE)","v":0},{"$f":"VLOOKUP(F29,'Banco de Matriculas '!A:C,3,FALSE)","v":0}]
[17,null,null,null,null,null,{"$f":"VLOOKUP(F30,'Banco de Matriculas '!A:C,2,FALSE)","v":0},{"$f":"VLOOKUP(F30,'Banco de Matriculas '!A:C,3,FALSE)","v":0},null,null,null,null,null,null,null,null,null,null,null,null,null,null,null,null,"Pagamento a menor ao favorecido de R$ 41,36 e não foi justificado a viagem no sábado"]
{"$rows_left_out":484}
{"sheet":"RELATÓRIO","index":1,"n_rows":1,"n_cols":23,"rows_kept":1,"cut":false,"hidden":false,"merged":[]}
["MÊS","DATA","PAG/REST.","Unidade Requisitante","Matrícula","Nome do favorecido","CPF","DOC. SIAFI","PAE","Finalidade do serviço ou atividade a ser desenvolvida","Roteiro","Início do Período","Fim do Período","Meio de transporte a ser utilizado","Valor unitário","Quantidade de diárias ","Valor correspondente à eventual dedução de auxílio-alimentação, indenização de transporte e auxílio-transporte","Outras Deduções ","Valor total das diárias","Nome do ordenador de despesas","Hipóteses elencadas no § 1º do art. 10 da Resolução 340/2015 do Conselho da Justiça Federal.\n(Equipe de Trabalho)","Hipóteses elencadas no § 3º do art. 10 da Resolução 340/2015 do Conselho da Justiça Federal.\n(Servidor acompanhamento Magistrado)","Hipóteses elencadas no § 5º do art. 10 da Resolução 340/2015 do Conselho da Justiça Federal.\n(Agente de segurança acompanhando magistrado ou Desembargador Federal)"]

{"sheet":"CARGA - RUBRICAS","index":2,"n_rows":354,"n_cols":4,"rows_kept":354,"cut":false,"hidden":false,"merged":[]}
["matricula","data_inicio","data_fim","valor"]
[{"$f":"IF(RELATÓRIO!E2=0,0,UPPER(RELATÓRIO!E2))","v":0},{"$f":"RELATÓRIO!L2","v":"00:00:00"},{"$f":"RELATÓRIO!M2","v":"00:00:00"},{"$f":"RELATÓRIO!S2","v":0}]
[{"$f":"IF(RELATÓRIO!E3=0,0,UPPER(RELATÓRIO!E3))","v":0},{"$f":"RELATÓRIO!L3","v":"00:00:00"},{"$f":"RELATÓRIO!M3","v":"00:00:00"},{"$f":"RELATÓRIO!S3","v":0}]
[{"$f":"IF(RELATÓRIO!E4=0,0,UPPER(RELATÓRIO!E4))","v":0},{"$f":"RELATÓRIO!L4","v":"00:00:00"},{"$f":"RELATÓRIO!M4","v":"00:00:00"},{"$f":"RELATÓRIO!S4","v":0}]
[{"$f":"IF(RELATÓRIO!E5=0,0,UPPER(RELATÓRIO!E5))","v":0},{"$f":"RELATÓRIO!L5","v":"00:00:00"},{"$f":"RELATÓRIO!M5","v":"00:00:00"},{"$f":"RELATÓRIO!S5","v":0}]
[{"$f":"IF(RELATÓRIO!E6=0,0,UPPER(RELATÓRIO!E6))","v":0},{"$f":"RELATÓRIO!L6","v":"00:00:00"},{"$f":"RELATÓRIO!M6","v":"00:00:00"},{"$f":"RELATÓRIO!S6","v":0}]
[{"$f":"IF(RELATÓRIO!E7=0,0,UPPER(RELATÓRIO!E7))","v":0},{"$f":"RELATÓRIO!L7","v":"00:00:00"},{"$f":"RELATÓRIO!M7","v":"00:00:00"},{"$f":"RELATÓRIO!S7","v":0}]
[{"$f":"IF(RELATÓRIO!E8=0,0,UPPER(RELATÓRIO!E8))","v":0},{"$f":"RELATÓRIO!L8","v":"00:00:00"},{"$f":"RELATÓRIO!M8","v":"00:00:00"},{"$f":"RELATÓRIO!S8","v":0}]
[{"$f":"IF(RELATÓRIO!E9=0,0,UPPER(RELATÓRIO!E9))","v":0},{"$f":"RELATÓRIO!L9","v":"00:00:00"},{"$f":"RELATÓRIO!M9","v":"00:00:00"},{"$f":"RELATÓRIO!S9","v":0}]
[{"$f":"IF(RELATÓRIO!E10=0,0,UPPER(RELATÓRIO!E10))","v":0},{"$f":"RELATÓRIO!L10","v":"00:00:00"},{"$f":"RELATÓRIO!M10","v":"00:00:00"},{"$f":"RELATÓRIO!S10","v":0}]
[{"$f":"IF(RELATÓRIO!E11=0,0,UPPER(RELATÓRIO!E11))","v":0},{"$f":"RELATÓRIO!L11","v":"00:00:00"},{"$f":"RELATÓRIO!M11","v":"00:00:00"},{"$f":"RELATÓRIO!S11","v":0}]
[{"$f":"IF(RELATÓRIO!E12=0,0,UPPER(RELATÓRIO!E12))","v":0},{"$f":"RELATÓRIO!L12","v":"00:00:00"},{"$f":"RELATÓRIO!M12","v":"00:00:00"},{"$f":"RELATÓRIO!S12","v":0}]
[{"$f":"IF(RELATÓRIO!E13=0,0,UPPER(RELATÓRIO!E13))","v":0},{"$f":"RELATÓRIO!L13","v":"00:00:00"},{"$f":"RELATÓRIO!M13","v":"00:00:00"},{"$f":"RELATÓRIO!S13","v":0}]
[{"$f":"IF(RELATÓRIO!E14=0,0,UPPER(RELATÓRIO!E14))","v":0},{"$f":"RELATÓRIO!L14","v":"00:00:00"},{"$f":"RELATÓRIO!M14","v":"00:00:00"},{"$f":"RELATÓRIO!S14","v":0}]
[{"$f":"IF(RELATÓRIO!E15=0,0,UPPER(RELATÓRIO!E15))","v":0},{"$f":"RELATÓRIO!L15","v":"00:00:00"},{"$f":"RELATÓRIO!M15","v":"00:00:00"},{"$f":"RELATÓRIO!S15","v":0}]
[{"$f":"IF(RELATÓRIO!E16=0,0,UPPER(RELATÓRIO!E16))","v":0},{"$f":"RELATÓRIO!L16","v":"00:00:00"},{"$f":"RELATÓRIO!M16","v":"00:00:00"},{"$f":"RELATÓRIO!S16","v":0}]
[{"$f":"IF(RELATÓRIO!E17=0,0,UPPER(RELATÓRIO!E17))","v":0},{"$f":"RELATÓRIO!L17","v":"00:00:00"},{"$f":"RELATÓRIO!M17","v":"00:00:00"},{"$f":"RELATÓRIO!S17","v":0}]
[{"$f":"IF(RELATÓRIO!E18=0,0,UPPER(RELATÓRIO!E18))","v":0},{"$f":"RELATÓRIO!L18","v":"00:00:00"},{"$f":"RELATÓRIO!M18","v":"00:00:00"},{"$f":"RELATÓRIO!S18","v":0}]
[{"$f":"IF(RELATÓRIO!E19=0,0,UPPER(RELATÓRIO!E19))","v":0},{"$f":"RELATÓRIO!L19","v":"00:00:00"},{"$f":"RELATÓRIO!M19","v":"00:00:00"},{"$f":"RELATÓRIO!S19","v":0}]
[{"$f":"IF(RELATÓRIO!E20=0,0,UPPER(RELATÓRIO!E20))","v":0},{"$f":"RELATÓRIO!L20","v":"00:00:00"},{"$f":"RELATÓRIO!M20","v":"00:00:00"},{"$f":"RELATÓRIO!S20","v":0}]
[{"$f":"IF(RELATÓRIO!E21=0,0,UPPER(RELATÓRIO!E21))","v":0},{"$f":"RELATÓRIO!L21","v":"00:00:00"},{"$f":"RELATÓRIO!M21","v":"00:00:00"},{"$f":"RELATÓRIO!S21","v":0}]
[{"$f":"IF(RELATÓRIO!E22=0,0,UPPER(RELATÓRIO!E22))","v":0},{"$f":"RELATÓRIO!L22","v":"00:00:00"},{"$f":"RELATÓRIO!M22","v":"00:00:00"},{"$f":"RELATÓRIO!S22","v":0}]
[{"$f":"IF(RELATÓRIO!E23=0,0,UPPER(RELATÓRIO!E23))","v":0},{"$f":"RELATÓRIO!L23","v":"00:00:00"},{"$f":"RELATÓRIO!M23","v":"00:00:00"},{"$f":"RELATÓRIO!S23","v":0}]
[{"$f":"IF(RELATÓRIO!E24=0,0,UPPER(RELATÓRIO!E24))","v":0},{"$f":"RELATÓRIO!L24","v":"00:00:00"},{"$f":"RELATÓRIO!M24","v":"00:00:00"},{"$f":"RELATÓRIO!S24","v":0}]
[{"$f":"IF(RELATÓRIO!E25=0,0,UPPER(RELATÓRIO!E25))","v":0},{"$f":"RELATÓRIO!L25","v":"00:00:00"},{"$f":"RELATÓRIO!M25","v":"00:00:00"},{"$f":"RELATÓRIO!S25","v":0}]
[{"$f":"IF(RELATÓRIO!E26=0,0,UPPER(RELATÓRIO!E26))","v":0},{"$f":"RELATÓRIO!L26","v":"00:00:00"},{"$f":"RELATÓRIO!M26","v":"00:00:00"},{"$f":"RELATÓRIO!S26","v":0}]
[{"$f":"IF(RELATÓRIO!E27=0,0,UPPER(RELATÓRIO!E27))","v":0},{"$f":"RELATÓRIO!L27","v":"00:00:00"},{"$f":"RELATÓRIO!M27","v":"00:00:00"},{"$f":"RELATÓRIO!S27","v":0}]
[{"$f":"IF(RELATÓRIO!E28=0,0,UPPER(RELATÓRIO!E28))","v":0},{"$f":"RELATÓRIO!L28","v":"00:00:00"},{"$f":"RELATÓRIO!M28","v":"00:00:00"},{"$f":"RELATÓRIO!S28","v":0}]
[{"$f":"IF(RELATÓRIO!E29=0,0,UPPER(RELATÓRIO!E29))","v":0},{"$f":"RELATÓRIO!L29","v":"00:00:00"},{"$f":"RELATÓRIO!M29","v":"00:00:00"},{"$f":"RELATÓRIO!S29","v":0}]
[{"$f":"IF(RELATÓRIO!E30=0,0,UPPER(RELATÓRIO!E30))","v":0},{"$f":"RELATÓRIO!L30","v":"00:00:00"},{"$f":"RELATÓRIO!M30","v":"00:00:00"},{"$f":"RELATÓRIO!S30","v":0}]
{"$rows_left_out":325}
{"sheet":"Banco de Matriculas ","index":3,"n_rows":2000,"n_cols":22,"rows_kept":2000,"cut":false,"hidden":false,"merged":[]}
["DADOS EXTRAÍDOS"]
["ORACLE > FOLHA > RELATÓRIO > RUBRICAS > SERVIDORES/CPFs por Rubrica = 999999 = extração por texto"]
[]
["MATRICULA","NOME","CPF"]
[{"$f":"N5","v":"MT18703"},{"$f":"S5","v":"ANDREA CRISTINA DE OLIVEIRA LEMOS"},{"$f":"P5","v":"806.728.331-15"},"FOLHA DE PAGAMENTO","2020-01-01","TRF1 - Folha Ordinária - Janeiro/2020 - Base :TRF1.","ATIVO","MATRICULA","SEQUD","CPF","SERVIDOR","RUBRICA","VALOR ","MT18703",0,"806.728.331-15",999999,14862.84,"ANDREA CRISTINA DE OLIVEIRA LEMOS"]
[{"$f":"N6","v":"MT36411"},{"$f":"S6","v":"ABEDNEGO SOUZA DE CASTRO"},{"$f":"P6","v":"668.525.872-15"},"FOLHA DE PAGAMENTO","2020-01-01","TRF1 - Folha Ordinária - Janeiro/2020 - Base :TRF1.","ATIVO","MATRICULA","SEQUD","CPF","SERVIDOR","RUBRICA","VALOR ","MT36411",0,"668.525.872-15",999999,12799.18,"ABEDNEGO SOUZA DE CASTRO"]
["MT36276","ADEMAR FERREIRA BARBOSA","192.991.091-68","FOLHA DE PAGAMENTO","2020-01-01","TRF1 - Folha Ordinária - Janeiro/2020 - Base :TRF1.","ATIVO","MATRICULA","SEQUD","CPF","SERVIDOR","RUBRICA","VALOR ","MT36276",0,"192.991.091-68",999999,10787.21,"ADEMAR FERREIRA BARBOSA"]
["MT18203","ADEMILSON ALVES DA COSTA","531.822.351-68","FOLHA DE PAGAMENTO","2020-01-01","TRF1 - Folha Ordinária - Janeiro/2020 - Base :TRF1.","ATIVO","MATRICULA","SEQUD","CPF","SERVIDOR","RUBRICA","VALOR ","MT18203",0,"531.822.351-68",999999,6425.97,"ADEMILSON ALVES DA COSTA"]
["MT36303","ADRIANA EVARINI","030.069.429-65","FOLHA DE PAGAMENTO","2020-01-01","TRF1 - Folha Ordinária - Janeiro/2020 - Base :TRF1.","ATIVO","MATRICULA","SEQUD","CPF","SERVIDOR","RUBRICA","VALOR ","MT36303",0,"030.069.429-65",999999,12600.8,"ADRIANA EVARINI"]
["MT29403","ADRIANA TINOCO DA SILVA","694.295.881-68","FOLHA DE PAGAMENTO","2020-01-01","TRF1 - Folha Ordinária - Janeiro/2020 - Base :TRF1.","ATIVO","MATRICULA","SEQUD","CPF","SERVIDOR","RUBRICA","VALOR ","MT29403",0,"694.295.881-68",999999,16940.669999999998,"ADRIANA TINOCO DA SILVA"]
["MT36458","ALAN MACHADO SANTOS","951.598.511-00","FOLHA DE PAGAMENTO","2020-01-01","TRF1 - Folha Ordinária - Janeiro/2020 - Base :TRF1.","ATIVO","MATRICULA","SEQUD","CPF","SERVIDOR","RUBRICA","VALOR ","MT36458",0,"951.598.511-00",999999,17824.310000000001,"ALAN MACHADO SANTOS"]
["MT36275","ALAN RODRIGO FUZINATO","987.713.611-20","FOLHA DE PAGAMENTO","2020-01-01","TRF1 - Folha Ordinária - Janeiro/2020 - Base :TRF1.","ATIVO","MATRICULA","SEQUD","CPF","SERVIDOR","RUBRICA","VALOR ","MT36275",0,"987.713.611-20",999999,22008.959999999999,"ALAN RODRIGO FUZINATO"]
["MT36010","ALESSANDRA AZEVEDO","006.086.139-83","FOLHA DE PAGAMENTO","2020-01-01","TRF1 - Folha Ordinária - Janeiro/2020 - Base :TRF1.","ATIVO","MATRICULA","SEQUD","CPF","SERVIDOR","RUBRICA","VALOR ","MT36010",0,"006.086.139-83",999999,23866.67,"ALESSANDRA AZEVEDO"]
["MT36134","ALEX HENRIQUES MOLINA","010.073.651-37","FOLHA DE PAGAMENTO","2020-01-01","TRF1 - Folha Ordinária - Janeiro/2020 - Base :TRF1.","ATIVO","MATRICULA","SEQUD","CPF","SERVIDOR","RUBRICA","VALOR ","MT36134",0,"010.073.651-37",999999,17149.36,"ALEX HENRIQUES MOLINA"]
["MT36228","ALEXANDRA BOTELHO SILVA SEGUNDO VALDERRAMAS","696.701.701-25","FOLHA DE PAGAMENTO","2020-01-01","TRF1 - Folha Ordinária - Janeiro/2020 - Base :TRF1.","ATIVO","MATRICULA","SEQUD","CPF","SERVIDOR","RUBRICA","VALOR ","MT36228",0,"696.701.701-25",999999,10445.790000000001,"ALEXANDRA BOTELHO SILVA SEGUNDO VALDERRAMAS"]
["MT36192","ALEXANDRE BARBOSA NOGUEIRA","683.234.922-04","FOLHA DE PAGAMENTO","2020-01-01","TRF1 - Folha Ordinária - Janeiro/2020 - Base :TRF1.","ATIVO","MATRICULA","SEQUD","CPF","SERVIDOR","RUBRICA","VALOR ","MT36192",0,"683.234.922-04",999999,11952.14,"ALEXANDRE BARBOSA NOGUEIRA"]
["MT36145","ALEXANDRE TOMASSINI PLEUTIN RODRIGUES","927.765.311-68","FOLHA DE PAGAMENTO","2020-01-01","TRF1 - Folha Ordinária - Janeiro/2020 - Base :TRF1.","ATIVO","MATRICULA","SEQUD","CPF","SERVIDOR","RUBRICA","VALOR ","MT36145",0,"927.765.311-68",999999,25273.19,"ALEXANDRE TOMASSINI PLEUTIN RODRIGUES"]
["MT36094","ALLAN LADEIA MIRANDA","047.455.776-64","FOLHA DE PAGAMENTO","2020-01-01","TRF1 - Folha Ordinária - Janeiro/2020 - Base :TRF1.","ATIVO","MATRICULA","SEQUD","CPF","SERVIDOR","RUBRICA","VALOR ","MT36094",0,"047.455.776-64",999999,31889.13,"ALLAN LADEIA MIRANDA"]
["MT36002","ALTAMIRANDO MUNIZ FILHO","193.051.331-34","FOLHA DE PAGAMENTO","2020-01-01","TRF1 - Folha Ordinária - Janeiro/2020 - Base :TRF1.","ATIVO","MATRICULA","SEQUD","CPF","SERVIDOR","RUBRICA","VALOR ","MT36002",0,"193.051.331-34",999999,10925.72,"ALTAMIRANDO MUNIZ FILHO"]
["MT27303","ALYSSON ANTONIO DE SIQUEIRA GODOY","699.549.251-04","FOLHA DE PAGAMENTO","2020-01-01","TRF1 - Folha Ordinária - Janeiro/2020 - Base :TRF1.","ATIVO","MATRICULA","SEQUD","CPF","SERVIDOR","RUBRICA","VALOR ","MT27303",0,"699.549.251-04",999999,14501.34,"ALYSSON ANTONIO DE SIQUEIRA GODOY"]
["MT36469","AMANDA CRISTINE ANTUNES CAETANO RUIZ","009.760.049-09","FOLHA DE PAGAMENTO","2020-01-01","TRF1 - Folha Ordinária - Janeiro/2020 - Base :TRF1.","ATIVO","MATRICULA","SEQUD","CPF","SERVIDOR","RUBRICA","VALOR ","MT36469",0,"009.760.049-09",999999,2978.69,"AMANDA CRISTINE ANTUNES CAETANO RUIZ"]
["MT36232","ANA CAROLINA ALCANTARINO JARDINI KUNKEL","022.250.301-70","FOLHA DE PAGAMENTO","2020-01-01","TRF1 - Folha Ordinária - Janeiro/2020 - Base :TRF1.","ATIVO","MATRICULA","SEQUD","CPF","SERVIDOR","RUBRICA","VALOR ","MT36232",0,"022.250.301-70",999999,14723.11,"ANA CAROLINA ALCANTARINO JARDINI KUNKEL"]
["MT30503","ANA CAROLINA DA VEIGA JARDIM PERES","895.089.631-15","FOLHA DE PAGAMENTO","2020-01-01","TRF1 - Folha Ordinária - Janeiro/2020 - Base :TRF1.","ATIVO","MATRICULA","SEQUD","CPF","SERVIDOR","RUBRICA","VALOR ","MT30503",0,"895.089.631-15",999999,18631.23,"ANA CAROLINA DA VEIGA JARDIM PERES"]
["MT36471","ANA CAROLINE BERNARDI","088.661.309-40","FOLHA DE PAGAMENTO","2020-01-01","TRF1 - Folha Ordinária - Janeiro/2020 - Base :TRF1.","ATIVO","MATRICULA","SEQUD","CPF","SERVIDOR","RUBRICA","VALOR ","MT36471",0,"088.661.309-40",999999,10787.89,"ANA CAROLINE BERNARDI"]
["MT36435","ANA CAROLINE CALHEIROS AMORIM SANTOS","075.416.454-35","FOLHA DE PAGAMENTO","2020-01-01","TRF1 - Folha Ordinária - Janeiro/2020 - Base :TRF1.","ATIVO","MATRICULA","SEQUD","CPF","SERVIDOR","RUBRICA","VALOR ","MT36435",0,"075.416.454-35",999999,9792.9500000000007,"ANA CAROLINE CALHEIROS AMORIM SANTOS"]
["MT36326","ANA FLAVIA MENDES FERNANDES MUELLER","173.964.808-09","FOLHA DE PAGAMENTO","2020-01-01","TRF1 - Folha Ordinária - Janeiro/2020 - Base :TRF1.","ATIVO","MATRICULA","SEQUD","CPF","SERVIDOR","RUBRICA","VALOR ","MT36326",0,"173.964.808-09",999999,14659.44,"ANA FLAVIA MENDES FERNANDES MUELLER"]
["JU621","ANA LYA FERRAZ DA GAMA FERREIRA","695.230.291-34","FOLHA DE PAGAMENTO","2020-01-01","TRF1 - Folha Ordinária - Janeiro/2020 - Base :TRF1.","ATIVO","MATRICULA","SEQUD","CPF","SERVIDOR","RUBRICA","VALOR ","JU621",0,"695.230.291-34",999999,40126.080000000002,"ANA LYA FERRAZ DA GAMA FERREIRA"]
["MT36210","ANA PAULA BISINOTO ROJAS","031.314.061-86","FOLHA DE PAGAMENTO","2020-01-01","TRF1 - Folha Ordinária - Janeiro/2020 - Base :TRF1.","ATIVO","MATRICULA","SEQUD","CPF","SERVIDOR","RUBRICA","VALOR ","MT36210",0,"031.314.061-86",999999,22361.58,"ANA PAULA BISINOTO ROJAS"]
["MT6403","ANA ROSA ALBUQUERQUE ALENCAR","441.905.901-00","FOLHA DE PAGAMENTO","2020-01-01","TRF1 - Folha Ordinária - Janeiro/2020 - Base :TRF1.","ATIVO","MATRICULA","SEQUD","CPF","SERVIDOR","RUBRICA","VALOR ","MT6403",0,"441.905.901-00",999999,21609.5,"ANA ROSA ALBUQUERQUE ALENCAR"]
["MT36063","ANALIDIA ABILIO MIGUEL DINIZ BRUM","702.845.551-34","FOLHA DE PAGAMENTO","2020-01-01","TRF1 - Folha Ordinária - Janeiro/2020 - Base :TRF1.","ATIVO","MATRICULA","SEQUD","CPF","SERVIDOR","RUBRICA","VALOR ","MT36063",0,"702.845.551-34",999999,34595.68,"ANALIDIA ABILIO MIGUEL DINIZ BRUM"]
{"$rows_left_out":1971}
{"sheet":"REFERÊNCIA","index":4,"n_rows":13,"n_cols":2,"rows_kept":13,"cut":false,"hidden":true,"merged":[]}
[]
["JANEIRO","PAG."]
["FEVEREIRO","REST."]
["MARÇO"]
["ABRIL"]
["MAIO"]
["JUNHO"]
["JULHO"]
["AGOSTO"]
["SETEMBRO"]
["OUTUBRO"]
["NOVEMBRO"]
["DEZEMBRO"]

{"sheet":"temp","index":5,"n_rows":5,"n_cols":4,"rows_kept":5,"cut":false,"hidden":false,"merged":[]}
["matricula","data_inicio","data_fim","valor"]
["MT36094","2019-12-02","2019-12-06",1732.89]
["MT36104","2019-12-08","2019-12-10",1515]
["JU621","2019-12-09","2019-12-13",3150]
["MT36376","2019-11-26","2019-11-26",211.86]