{"text_format":"1","workbook":"xlsx","n_sheets":7,"sheets":["INÍCIO","PAC","CAC","CAC - Acompanhamento","Orientações - uso das planilhas","Tabela temporalidade","Resumo_DADOS"],"not_rendered":{"charts":3,"images":0,"macros":0,"external_links":0,"defined_names":18,"comments":0,"pivot_tables":0},"unopened":[],"bounds":{"document_bytes":16777216,"sheet_cells":100000,"rows_first":2000,"rows_last":500,"rows_between":2000,"halvings":0,"cell_chars":16384,"cell_head_chars":4096},"cells_cut":0,"cells_raw":0,"read":"whole","date_system":"1900"}

{"sheet":"INÍCIO","index":0,"n_rows":0,"n_cols":0,"rows_kept":0,"cut":false,"hidden":true,"merged":[]}

{"sheet":"PAC","index":1,"n_rows":46,"n_cols":18,"rows_kept":46,"cut":false,"hidden":false,"merged":[]}
["1. Unidade requisitante\n(informar ID)","2. Descrição sucinta da demanda","3. Alinhamento da demanda com diretrizes e metas institucionais","4. Justificativa expressa para a contratação","Nº de itens","Descrição Geral","5. Código de item","Elemento de despesa","6. Quantidade total estimada e unidade de medida","7. Valor total estimado","8. Vinculação ou dependência, se houver, com a contratação de outro item para sua execução*","9. Data-limite para entrega dos bens ou início da prestação dos serviços*","10. Prazo previsto para a execução*","11. Objeto passível de contratação por  compra compartilhada?\n(sim/não)","12. Forma prevista para a contratação*\n(licitação, dispensa, inexigibilidade, prorrogação ou renovação)","13. Grau de prioridade","14. Critérios de sustentabilidade*","15. Riscos da não contratação"]
["SEVIT - 15317159","Lavagem de veículos para os veículos oficiais da Seção Judiciária de Roraima.","Alinha-se com disposições contidas na  IN-14-08 TRF1, Administração de Veículos, modulo manutenção e recuperação.","Limpeza, higienização dos veículos para preservar a saúde dos usuários.",6,"Lavagens e polimento dos veículos oficiais da frota da Seção Judiciária de Roraima.","00001354-4",null,20,2010,"NÃO","2023-03-01","10 meses","NÃO","Dispensa",3,"Utilização de produtos que agridam o meio-ambiente; Utilização de métodos que evitem o desperdício de água tratada, conforme Dec n. 48.138/2003.","Degradação do patrimônio; Insalubridade de operação."]
["SEVIT - 15317179","Serviços de manutenção preventiva e corretiva a serem executados nos veículos oficiais pertencentes à SJRR.","Alinha-se com as determinações estabelecidas nas Instruções Normativas nº 14-08 e 14-10 do TRF 1ª Região, bem como à Resolução nº 176/2013 do CNJ.","Dever da Administração de prestar o adequado serviço de manutenção dos bens que compõem o patrimônio público; e necessidade de garantir a segurança dos usuários.",1,"Serviço de manutenção preventiva / corretiva em veículos oficiais da SJRR","00000587-8",null,"45 H",6750,"NÃO","2023-03-30","9 meses","NÃO","Dispensa",3,"Destinação adequada de óleos lubrificantes para evitar contaminação do meio-ambiente.","Risco à segurança dos usuários; peralização de atividades que dependam do transporte com veículos; e degradação do patrimônio público."]
["SEVIT - 15317201","Fornecimento de combustíveis (gasolina comum, óleo diesel comum, óleo diesel S10 e etanol), destinados ao abastecimento dos veículos oficiais e do grupo gerador de energia elétrica da Justiça Federal de Primeira Instância - Seção Judiciária de Roraima","Alinha-se com as disposições contidas na  IN-14-08 TRF1, Administração de Veículos, modulo manutenção e recuperação.","Fornecimento dos meios necessários para o funcionamento dos veículos oficiais e grupo gerador.",4,"Comnustíveis - Gasolina, Diesel e Etanol","BR0016950; BR0016993; BR00150371",null,1500,8872,"NÃO","2023-04-30","12 meses","NÃO","Licitação",4,"Fornecedor deverá constar do Cadastro Técnico Federal de Atividades Potencialmente Poluidoras e Utilizadoras de Recursos Ambientais – CTF/APP","Paralização das atividades de transporte e impossibiliade de uso do Grupo Gerador em caso de falta de energia."]
["SEVIT - 15317489","Serviços de manutenção preventiva e corretiva de Porta Giratória Detector de Metais.","Alnha-se com as disposições contidas na  IN-14-08 TRF1, considerando a necessidade da Administração Pública de zelar pela segurança da SJRR através do controle de acesso de pessoas e materiais.","Manter a Porta Giratória - Detector de Metais  em perfeitas condições de uso.",2,"Manutenções preventivas e corretivas da porta giratória com detector de metais.","00001840-6",null,3,5500,"NÃO","2023-06-07","12 meses","NÃO","Prorrogação",3,null,"Aumento do risco à integridade das pessoas e do patrimônio público no âmbito da SJRR. "]
["SEVIT - 15342869","Serviços de seguro automotivo para os veículos oficiais que integram a frota da SJRR.","Alinha-se com as disposições contidas na  IN-14-08 TRF1, Administração de Veículos.","Necessidade de resguardar os veículos e seus condutores em eventuais ocorrências de danos e/ou de sinistros.",1,"Apólice de Seguros Automobilísticos.","00002276-4",null,1,7123,"NÃO","2023-06-07","12 meses","NÃO","Dispensa",3,"Observância da legislação atinente às melhores práticas de sustentabilidade ambiental no âmbito das contratações públicas.","Paralização de atividades essenciais, sucateamento de patrimônio público."]
["SEVIT - 15343725","Contratar ou firmar convênio com instituições de segurança pública, para realização de Curso de Treinamento de Tiro, para os servidores, Agentes da Polícia Judicial, aptos a portar arma de fogo da Seção Judiciária de Roraima.","Alinha-se com as disposições contidas no Art. 3 da RESOLUÇÃO N. 686/2020 - CJF, DE 15 DE DEZEMBRO DE 2020.","Considerando a obrigatoriedade da Administração Pública em prestar o adequado serviço de segurança e proteção a magistrados, servidores e jurisdicionados, bem como ao patrimônio público, torna-se necessário a contratação desses serviços.",1,"Curso de Treinamento de Tiro com Carga horária mínima de 4 horas com Certificado emitido contendo: carga horária, conteúdo programático, local, data de início término, assinatura do aluno e instrutor.",null,null,3,4500,"NÃO","2023-08-30","30 Dias","NÃO","Dispensa",3,"Descarte correto dos materiais empregados no curso","Desconformidade com a legislação"]
["SEVIT - 15344700","Serviços de vigilância armada e segurança patrimonial 24h, com postos nos principais locais de acesso do edifício-sede da Seção Judiciária de Roraima.","alinha-se com as determinações estabelecidas nas Instruções Normativas nº 14-08 e 14-10 do TRF 1ª Região, bem como à Resolução nº 176/2013 do CNJ.","Considerando a obrigatoriedade da Administração Pública em prestar o adequado serviço de segurança e proteção a magistrados, servidores e jurisdicionados, bem como ao patrimônio público.",3,"Vigilante diurno em turno de 12 x 36 horas; Vigilante noturno em turno de 12 x 36 horas e Vigilante diurno em turnos de 5 x 2 horas 44 horas semanais.","00002401-5",null,6,295269.36,"NÃO","2023-10-26","12 meses","NÃO","Prorrogação",4,"Promover ações educativas aos seus colaboradores sobre o consumo eficiente de energia elétrica e água","Entrada de pessoas não autorizadas ou objetos proibidos; vulnerabilidade do prédio a furtos e/ou vandalismo."]
["SEVIT - 15344763","Serviços de treinamento (certificação) de atualização e formação de Brigada de Prevenção e Combate a Incêndio.","Alinhamento com disposições contidas na  IN-14-10 TRF1, considerando a necessidade/obrigatoriedade da Administração Pública de zelar pela segurança de magistrados, servidores, jurisdicionados e instalações físicas da Justiça Federal do Estado de Roraima.","Necessidade de treinar servidores e outros colaboradores para agir prontamente em caso de princípio de incêndio nas dependências da SJRR.",1,"Curso de formação da brigada de incêndio da SJRR.","00001340-4",null,"12 horas",2400,"NÃO","2023-10-01","30 Dias","NÃO","Dispensa",3,"Cumprir, no que couber, as exigências do art. 6° da Instrução Norma MPOG n°01, de 19 de janeiro de 2010, que estabelece as práticas de sustentabilidade na execução dos serviços","Riscos às instalações da SJRR bem como à integridade física de usuários."]
["SEVIT - 15345811","Serviços de recarga e de manutenção dos extintores de incêndio pertencentes à Seção Judiciária de Roraima.","Alinhamento com as diretrizes de segurança institucional. para proteger as pessoas e o patrimônio sob responsabilidade da SJRR.","Necessidade de manter em perfeitas condições de uso os extintores de incêndio da Seção Judiciária de Roraima, objetivando a preservação da segurança de pessoas e de ambientes.",3,"Recarga e Manutenção de extintores de incêndio.","0000366-2",null,66,6250,"NÃO","2023-10-01","30 Dias","SIM","Dispensa",3,"Adotar boas práticas de otimização de recursos/redução de desperdícios/ menor poluição","Impossibilidade de controlar princícpios de incêndio, caso os extintores falhem por falta de manutenção."]
["SEVIT - 15345982","Serviços de manutenção preventiva e corretiva de Equipamento de Inspeção de Raio X, tipo Scanner, modelo Spectrum 5030.","Alinha-se com disposições contidas na  IN-14-08 TRF1.","Manter o Scanner Detector de Metais  em perfeitas condições de uso",2,"Manutenção preventiva e Corretiva do Scanner","00000573-8",null,2,6800,"NÃO","2023-11-01","12 Meses","SIM","Prorrogação",3,null,"Degradação do patrimônio"]
["SEVIT - 15846451","Uniformes e acessórios de identificação visual, para os Agentes da Polícia Judicial.","Alinha-se com o Plano Estratégico da Justiça Federal - PEJF 2021/2026, aos macros desafios \"Fortalecimento da segurança e proteção institucional\".","Atendimento às Normas que regulam o cargo de  Agente de Polícia Judicial, Portaria PRESI 222/2021.",4,"Aquisição de uniformes e acessórios de identificação visual","BR0038059",null,24,3340,"NÃO","2023-04-01","45 dias","NÃO","Dispensa",3,"Devem ser utilizados, preferencialmente, produtos menos poluentes e agressivos ao meio ambiente que utilizem tecidos que tenham em sua composição fibras com maior resistência à tração e durabilidade.","- Não conformidade com a norma pertinente;\n- Enfraquecimento da identidade institucional dos Agentes;\n- Ausência de padronização dos elementos e símbolos que promovem uniformidade no reconhecimento dos servidores da polícia judicial."]
["SECAM - 15328939","Serviços de publicação de editais, avisos e notas oficiais de interesse desta Seccional em jornal local de grande circulação Regional.","A demanda está alinhada com os Macrodesafios do Poder Judiciário “Consolidação do sistema de precedentes obrigatórios\" e com o Macrodesafio específico \"Fortalecimento da segurança e proteção institucional\".","Assegurar publicidade, por meio de jornal local de grande circulação, a editais avisos e notas oficiais de interesse da Justiça Federal de 1ª Instância - Seção Judiciária de Roraima.",1,"Publicação de matérias na página de editais do jornal.","00001004-9",null,40,4800,"NÃO","2023-01-01","12 Meses","NÃO","Inexigibilidade","Médio","Não recebemos nenhum documento em forma física, apenas digitais, objetivando a redução do uso de papeis, tonners e demais produtos.","Falta de publicidade nos atos oficiais da SJRR, deixando de cumprir determinações legais."]
["SECAM - 15732555","Serviços de locação de 04 (quatro) fotocopiadoras, com fornecimento de suprimentos.","A demanda está alinhada com os Macrodesafios do Poder Judiciário “Agilidade e produtividade na prestação jurisdicional\" e com o Macrodesafio específico \"Fortalecimento da segurança e proteção institucional\"","Garantir que os serviços de reprografia, impressão e digitalização de documentos sejam prestados de maneira contínua e sem interrupções para o bom andamento dos trabalhos na Justiça Federal de Roraima",1,"locação de 04 (quatro) fotocopiadoras, com fornecimento de suprimentos, exceto papel, com franquia mensal de 20.000 cópias, com manutenção preventiva e corretiva.","00002316-7",null,4,36000,"NÃO","2023-06-26","12 Meses","NÃO","Prorrogação","Médio","O contrato prevê que o contratado faça a retirada dos cartuchos de tonners usados, para o descarte correto dos mesmos","Redução na qualidade dos serviços prestados."]
["SECAM - 15732641","Serviços de Telefonia Móvel Pessoal - SMP.","A demanda está alinhada com os Macrodesafios do Poder Judiciário “Agilidade e produtividade na prestação jurisdicional\" e com o Macrodesafio específico \"Fortalecimento da segurança e proteção institucional\".","A implantação de procedimento de intimação das partes, advogados e dos peritos via WhatsApp no âmbito do Juizado Especial Federal e do Núcleo de Conciliação da Seção Judiciária de Roraima, conforme a Resolução Presi nº 50 de 23/11/2017.",11,"Prestação de SERVIÇO MÓVEL PESSOAL - SMP, na modalidade LOCAL, com tecnologia digital GSM","00001813-9",null,"7608 min",13052.88,"NÃO","2023-07-22","12 Meses","NÃO","Licitação","Alto","Não recebemos mais nenhum tipo de documento de forma física, somente digitais, objetivando a economia em papel e demais insumos","Redução na qualidade dos serviços prestados."]
["SECAM - 15331353","Serviços de postagens e encomendas da Seção Judiciária de Roraima.","A demanda está alinhada com os Macrodesafios do Poder Judiciário “Agilidade e produtividade na prestação jurisdicional\" e com o Macrodesafio específico \"Fortalecimento da segurança e proteção institucional\"","Para assegurar maior eficiência, um dos princípios de Administração Pública previstos no artigo 37 da Constituição Federal, a contratação da ECT mostra-se adequada a suprir as necessidades da SJRR.",1,"Postagens de correspondências e documentos oficiais da Seção Judiciária de Roraima.","0000428-6",null,null,34000,"NÃO","2022-03-31","12 meses","NÃO","Prorrogação","Alto","Não recebemos nenhum documento em forma física, apenas digitais, objetivando a redução do uso de papeis e demais insumos.","Atrasos na prestação de serviços aos jurisdicionados, visto que alguns serviços são feitos por correios."]
["SECAM - 15732819"," Serviço de Telefonia Fixa Comutada.","A demanda está alinhada com os Macrodesafios do Poder Judiciário “Agilidade e produtividade na prestação jurisdicional\" e com o Macrodesafio específico \"Fortalecimento da segurança e proteção institucional\"","A contratação se justifica pela necessidade dos serviços de telefonia em todos os setores da Seção Judiciária de Roraima. Ressaltando ser um serviço essencial ao bom andamento dos trabalhos realizados pela Seccional.",6," Serviço de Telefonia Fixa Comutada, mediante prestação de serviços telefônicos Local fixo-fixo, fixo-móvel e DDD.","00002187-3",null,"89000 min",3605,"NÃO","2023-08-28","12 Meses","NÃO","Licitação","Alto","Não recebemos nenhum documento em forma física, apenas digitais, objetivando a redução do uso de papeis e demais insumos"," Atrasos na prestação de serviços aos jurisdicionados, visto que alguns serviços estão sendo feitos via ligação telefonica"]
["SEINF - 15328883","Serviços técnicos especializados para apoio na área de TI para atividades de apoio.","Indicadores do Plano Estratégico de Tecnologia da Informação da Justiça Federal – PETI para 2021-2026, ambos aprovados pela resolução CJF-RES-2020/00685 de 15 de dezembro de 2020.","Garantir a continuidade dos serviços prestados no escopo do Contrato nº 5451137/2018 (5451137), cuja vigência expirará em 31.01.2023.",1,"Prestação de serviços técnicos continuados da área de tecnologia da informação para atendimento e suporte aos usuários de TI da Seção Judiciária de Roraima.",null,null,1,472680,"NÃO","2023-01-31","30 Meses","NÃO","Licitação",4,"USO - suporte remoto (menor consumo de energia local).","Impactos negativos na prestação de serviço da atividade fim (causando indisponibilidade de serviços ofertados aos jurisdicionados)."]
["SELIT - 15330055","Fornecimento de Passagem Aérea","Macrodesafios Nacionais:  Aperfeiçoamento da gestão de pessoas;  Indice de capacitação de magistrados;  Indice de capacitação de servidores.","Necessidade de deslocamento dos servidores e colaboradores da Justiça Federal quando do exercício de suas atribuições, seja realizando cursos de capacitação ou em viagens a serviço do órgão.",2,"Prestação de serviços de agenciamento de viagens: emissão, remarcação e cancelamento de passagens aéreas nacionais e internacionais.","BR00000371-9 ",null,100,100000,"NÃO","2023-04-02","12 Meses","SIM","Licitação",3,"Todos os procedimentos são realizados de forma eletrônica, utilizando o Sistema de Solicitação de Viagens a Serviço - E-AVS, plataforma desenvolvida especificamente para este fim","Impossibilidade de deslocamento dos servidores e magistrados para outros estados do território nacional"]
["SELIT - 15330056","Aquisição de assinatura online para a plataforma de pesquisa preços","Macrodesafios Nacionais  Aperfeiçoamento da gestão administrativa e da governança judiciária.","A Justiça Federal de Roraima utiliza a ferramenta desde 2013, sendo uma plataforma de fácil operação, confiável, ágil para acelerar os procedimentos de cotação e estimativa de preços e principalmente é eficiente na realização de pesquisa de preços",1,"Assinatura informatizada para acesso a plataforma de pesquisa","BR00002310-8",null,1,10865,"NÃO","2023-05-31","12 Meses","NÃO","Dispensa",2,"A assinatura da plataforma é para o acesso na versão eletrônica, não havendo outro modo de usá-la","Caso a contratação não seja efetuada, a pesquisa de preços terá que ser feita com base nos portais gratuitos, no qual não atendem de maneira satisfatória esta seção, fazendo com que eleve o tempo de tramitação dos processos."]
["SEBES - 15770124","Assistência médica, psicológica e odontológica direta aos magistrados e servidores ativos, inativos, e aos seus dependentes","A necessidade mencionada está alinhada com o Plano Estratégico da Justiça Federal - PEJF 2021/2026","A Seção Judiciária de Roraima oferece através da Seção de Benefícios Sociais, assistência direta a magistrados, servidores e seus familiares que compreende atendimento médico, odontológico e de psicologia",4,"Assistência médica, psicológica e odontológica direta aos magistrados e servidores ativos, inativos, e aos seus dependentes",null,null,4,298017.71999999997,"NÃO","2023-01-28","12 Meses","NÃO","Licitação",2,"Orientação e conscientização dos funcionários sobre consumo de energia, consumo de papel, consumo de água, em consonância com o Plano de Ação Socioambiental 2021/2022 da SJRR","Interrupção da assistência médica, psicológica e odontológica aos magistrados, servidores e dependentes na dependência da Seção Judiciária de Roraima"]
["SEBES - 15770520","Manutenção preventiva e corretiva dos equipamentos do consultório odontológico da SJRR","Plano Estratégico da Justiça Federal - PEJF 2021/2026","Os serviços são necessários para atender à demanda por manutenção dos equipamentos do consultório odontológico. Bens de uso contínuo e destinados à saúde dos magistrados e servidores",1,"Manutenção em Equipamentos de Consultório Odontológico","0579-7",null,24,6000,"NÃO","2023-07-29","12 Meses","NÃO","Prorrogação",1,null,"Prejuízo à realização das tarefas rotineiras do consultório odontológico, ocasionando a interrupção das atividades e impactos negativos na prestação do serviço"]
["SEBES - 15330874","Aquisição de Vacinas para imunização contra a gripe H1N1","Plano Estratégico da Justiça Federal - PEJF 2021/2026","necessidade de imunização de magistrados e servidores, em exercício na sede da Seção Judiciária de Roraima, com o objetivo de manter baixo o índice de absenteísmo decorrente de afastamento por motivo de doença acometida pela gripe.",1,"DOSES DA VACINA PRA GRIPE SAZONAL CONTENDO AS CEPAS DE OCORRÊNCIA DO ANO VIGENTE DE ACORDO COM AS RECOMENDAÇÕES DA OMS (ORGANIZAÇÃO MUNDIAL DE SAÚDE)","BR0246141",null,115,13800,"NÃO","2023-04-30","2 Meses","NÃO","Dispensa",2,null,"Aumento do absenteísmo de servidores e magistrados em razão de contaminação do vírus da gripe"]
["SEBES - 15330879","Materiais e medicamentos para os consultórios médico e odontológico da Seção Judiciária de Roraima","A necessidade mencionada está alinhada com o Plano Estratégico da Justiça Federal - PEJF 2021/2026","A Seção Judiciária de Roraima oferece, por meio da Seção de Benefícios Sociais, assistência direta a magistrados, servidores e seus familiares compreendendo atendimento médico (clínico geral), odontológico e de psicologia",137,"aquisição dos materiais odontológicos e medicamentos",null,null,684,25902.43,"SIM","2023-07-31","2 Meses","NÃO","Licitação",1,"Em alinhamento com o Plano de Logística Sustentável da Seção Judiciária de Roraima, sobretudo com o Referencial Estratégico Socioambiental que prevê como meta o absenteísmo de magistrados e servidores abaixo ou igual a 3%","Prejuízo à realização das tarefas rotineiras dos consultórios médico e odontológico, ocasionando a interrupção das atividades e impactos negativos na prestação do serviço"]
["SEMAP - 15331081","Aquisição de materiais de consumo diversos para consecução das atividades internas na SJRR.","As necessidades mencionadas estão alinhadas com dispositivos presentes no Plano de Logística Sustentável da SJRR o qual remete ao ordenamento jurídico concernente à legislação da gestão socioambiental no país","Os materiais relacionados no objeto são necessários ao cumprimento das atividades desempenhadas pelos servidores e colaboradores internos. A aquisição se justifica pela continuidade do serviço público",22,"Aquisição de materiais de expediente e consumo",null,null,1150,52505,"NÃO","2023-03-31","45 Dias","NÃO","Licitação",3,"O procedimento observará em todas as fases as orientações e normas voltadas para a sustentabilidade ambiental, bem como a apresentação de documentos físicos, copiados ou impressos, somente em papel reciclado","Prejuízo à realização das tarefas rotineiras das áreas meio e fim, com impactos negativos na produtividade, pela falta de itens que auxiliam na consecução das tarefas internas"]
["SESEG - 15770821","Serviços de limpeza, conservação, copeiragem e jardinagem, com fornecimento de material de limpeza e jardinagem.","Alinha-se com as determinações estabelecidas no Plano Estratégico da Justiça Federal da 1ª Região – Planest 2021-2026","Assegurar a continuidade dos serviços de limpeza, jardinagem e copeiragem nas dependências do edifício-sede da Justiça Federal em Roraima",3,"Prestação de serviços continuados de limpeza e conservação nas dependências da Seção Judiciária de Roraima",null,null,10,451521.73,"NÃO","2023-01-31","12 Meses","SIM","Prorrogação",4,"A futura contratada deverá, nos termos do Anexo V da Instrução Normativa SLTI/MPOG n° 2, de 30/04/2008, e da Instrução Normativa SLTI/MPOG n° 1, de 19/01/2010, a contratada deverá adotar as providências contidas nas alíneas \"a\" a \"g\".","Riscos à saúde, segurança e bem-estar dos servidores, terceirizados e usuários das instalações da Seção Judiciária de Roraima em decorrência de um ambiente desorganizado e insalubre"]
["SESEG - 15770921","Prestação de serviços continuados de apoio administrativo nas dependências da Seção Judiciária de Roraima","Alinha-se com as determinações estabelecidas no Plano Estratégico da Justiça Federal da 1ª Região – Planest 2021-2026"," Possuem dedicação exclusiva de mão de obra, cuja interrupção comprometeria o pleno funcionamento da instituição, e de caráter auxiliar, correspondendo a cargos considerados extintos ou inexistentes no quadro funcional do Governo Federal",1,"Prestação de serviços continuados de apoio administrativo nas dependências da Seção Judiciária de Roraima","5380",null,14,525433.92000000004,"NÃO","2023-01-09","12 Meses","SIM","Licitação",3,null,"Atrasos na prestação de serviços aos jurisdicionados"]
["SESEG - 15771480 ","Prestação de serviços continuados de manutenção predial nas dependências da Seção Judiciária de Roraima","Alinha-se com as determinações estabelecidas no Plano Estratégico da Justiça Federal da 1ª Região – Planest 2021-2026","Garantir o pleno funcionamento dos sistemas prediais e reduzir a probabilidade de falhas e/ou degradação das instalações físicas da Seccional, através de serviços de reparos e consertos",1,"Prestação de serviços continuados de manutenção predial nas dependências da Seção Judiciária de Roraima","1627",null,2,85813.87,"SIM","2023-03-06","12 Meses","SIM","Prorrogação",4,"A contratada deverá providenciar o recolhimento e o adequado descarte das lâmpadas fluorescentes originárias da contratação, recolhendo-as ao sistema de coleta, para fins de sua destinação final ambientalmente adequada.","Riscos à segurança e bem-estar dos servidores, terceirizados e usuários das instalações da Seção Judiciária de Roraima em decorrência de um ambiente com instalações prediais inadequadas à prestação jurisdicionais"]
["SESEG - 15771771","Prestação de serviços continuados de manutenção no elevador localizado nas dependências da Seção Judiciária de Roraima","Alinha-se com as determinações estabelecidas no Plano Estratégico da Justiça Federal da 1ª Região – Planest 2021-2026","A Seção Judiciária do Estado Roraima, visando atender às normas de acessibilidade aos prédios públicos, em especial à  ABNT NBR-9050",1,"Prestação de serviços continuados de manutenção no elevador localizado nas dependências da Seção Judiciária de Roraima","20338",null,12,7560,"NÃO","2023-05-26","12 Meses","SIM","Prorrogação",3,null,"Descumprimento da lei de acessibilidade aos prédios públicos"]
["SESEG - 15771816","Prestação de serviços continuados de manutenção em 6(seis) no-breaks prediais localizados nas dependências da Seção Judiciária de Roraima","Alinha-se com as determinações estabelecidas no Plano Estratégico da Justiça Federal da 1ª Região – Planest 2021-2026","com o objetivo de assegurar aos usuários da Seção Judiciária de Roraima uma prestação jurisdicional de forma contínua, ou seja, que esta não fique sobrestada em decorrência da falta de fornecimento de energia elétrica e por oscilações",1,"Prestação de serviços continuados de manutenção em 6(seis) no-breaks prediais localizados nas dependências da Seção Judiciária de Roraima","2658",null,12,34500,"SIM","2023-08-31","12 Meses","SIM","Prorrogação",4,null,"Interrupção total dos sistemas informatizados"]
["SESEG - 15771899","Prestação de serviços continuados de fornecimento de energia elétrica para a Seção Judiciária de Roraima","Alinha-se com as determinações estabelecidas no Plano Estratégico da Justiça Federal da 1ª Região – Planest 2021-2026","Grande maioria dos equipamentos funcionam à base de energia elétrica, razão pela qual se faz imprescindível a contratação ora pretendida",1,"Prestação de serviços continuados de fornecimento de energia elétrica para a Seção Judiciária de Roraima","5355",null,12,360000,"NÃO","2023-06-30","12 Meses","SIM","Inexigibilidade",4,null,"Interrupção total dos sistemas informatizados e de todos equipamentos eletro-eletrônicos da Seccional"]
["SESEG - 15771980","Prestação de serviços continuados de abastecimento  de água encanada para a Seção Judiciária de Roraima","Alinha-se com as determinações estabelecidas no Plano Estratégico da Justiça Federal da 1ª Região – Planest 2021-2026","Item de primordial importância para limpeza das instalações físicas e irrigação das plantas que ornamentam o edifício",1,"Prestação de serviços continuados de abastecimento  de água encanada para a Seção Judiciária de Roraima","22845",null,12,3000,"NÃO","2023-01-31","12 Meses","SIM","Inexigibilidade",4,null,"Riscos à saúde e bem-estar dos servidores, terceirizados e usuários das instalações da Seção Judiciária em decorrência de um ambiente insalubre"]
["SESEG - 15772019","Prestação de serviço de manutenção no grupo gerador, subestação e USCA localizados nas dependências da Seção Judiciária de Roraima","Alinha-se com as determinações estabelecidas no Plano Estratégico da Justiça Federal da 1ª Região – Planest 2021-2026","Efetuar manutenção preventiva/corretiva no grupo gerador, subestação e USCA,  com o objetivo de assegurar de forma contínua o fornecimento de energia elétrica em caso da interrupção do fornecimento por parte da concessionária",1,"Prestação de serviço de manutenção no grupo gerador, subestação e USCA localizados nas dependências da Seção Judiciária de Roraima","2356",null,1,31725,"NÃO","2023-12-08","12 Meses","NÃO","Prorrogação",4,"Nos termos do artigo 33, inciso IV, da Lei n° 12.305/2010 – Política Nacional de Resíduos Sólidos e Resolução CONAMA n° 362, de 23/06/2005, a contratada deverá efetuar o recolhimento e o descarte adequado do óleo lubrificante usado .","Interrupção total do fornecimento de energia elétrica"]
["SESEG - 15772067","Prestação de serviços continuados  de manutenção preventiva/corretiva nos equipamentos que compõem os sistemas de abastecimento d'água e de combate a incêndio localizados nas dependências da Seção Judiciária de Roraima","Alinha-se com as determinações estabelecidas no Plano Estratégico da Justiça Federal da 1ª Região – Planest 2021-2026","A contratação ora pretendida busca assegurar o funcionamento dos sistemas de combate a incêndio e de abastecimento d’água instalados no edifício-sede desta Seção Judiciária",1,"Prestação de serviços continuados  de manutenção preventiva/corretiva nos equipamentos que compõem os sistemas de abastecimento d'água e de combate a incêndio localizados nas dependências da Seção Judiciária de Roraima","1627",null,2,12000,"NÃO","2023-11-03","12 Meses","NÃO","Prorrogação",3,"Nos termos do artigo 33, inciso IV, da Lei n° 12.305/2010 – Política Nacional de Resíduos Sólidos e Resolução CONAMA n° 362, de 23/06/2005, a contratada deverá efetuar o recolhimento e o descarte adequados dos resíduos e embalagens utilizados ","Interrupção total do fornecimento de água encanada"]
["SESEG - 15711791","Manter o volume de dejetos contidos nas fossas sépticas em níveis aceitáveis, reduzindo-se a possibilidade de transbordamentos; Manter a rede de esgoto desobstruída, evitando-se, assim, transbordamentos e mau cheiro","Alinha-se com as determinações estabelecidas no Plano Estratégico da Justiça Federal da 1ª Região – Planest 2021-2026","Pela necessidade em manter limpas e sem mal cheiro as caixas de gordura e as fossas que recebem os resíduos das torneiras e sanitários, buscando tornar o ambiente adequado para a utilização dos magistrados, servidores e jurisdicionados",2,"Serviço de esgotamento de fossa séptica e remoção de detritos; Serviço de desobstrução de rede de esgoto","1627",null,30,7500,"NÃO","2023-01-31","12 Meses","NÃO","Dispensa",1,"Contratada deverá elaborar plano de gerenciamento de resíduos sólidos, sujeito à aprovação da autoridade competente","Riscos à saúde e bem-estar dos servidores, terceirizados e usuários das instalações da Seção Judiciária em decorrência de um ambiente insalubre"]
["SESEG - 15711835","Carga de gás de cozinha (GLP) em botija de 13 quilos","Alinha-se com as determinações estabelecidas no Plano Estratégico da Justiça Federal da 1ª Região – Planest 2021-2026","Devido à  necessidade de se preparar cafés, chás e refeições em geral para eventos tais como júris, conciliações, audiências, etc., faz-se necessária a aquisição do item.",1,"Carga de gás de cozinha (GLP) em botija de 13 quilos","461652",null,30,4500,"SIM","2023-01-31","12 Meses","SIM","Dispensa",1,"O GLP apresenta grande aplicabilidade como combustível devido as suas características de alto poder calorífico, excelente qualidade de queima, fácil manuseio, baixo impacto ambiental e facilidade de armazenamento.","Prejuízo à realização das tarefas rotineiras das áreas meio e fim, com impactos negativos na produtividade."]
["SESEG - 15711889","Fornecimento de gêneros alimentícios (café, açucar,adoçante, água mineral)","Alinha-se com as determinações estabelecidas no Plano Estratégico da Justiça Federal da 1ª Região – Planest 2021-2026","Devido à  necessidade de se preparar café e disponibilizar água potável para eventos tais como júris, conciliações, audiências, etc., faz-se necessária a aquisição dos itens em comento",6,"Fornecimento de gêneros alimentícios",null,null,6230,68944,"SIM","2023-03-31","12 Meses","SIM","Licitação",2,"quanto ao descarte, é de responsabilidade da empresa contratada de serviços de limpeza e conservação a realização do adequado acondicionamento dos resíduos recicláveis descartados pela Administração","Prejuízo à realização das tarefas rotineiras das áreas meio e fim, com impactos negativos na produtividade"]
["SESEG - 15712033","contratação dos serviços de manutenções preventivas periódicas e corretivas nos aparelhos condicionadores de ar","Alinha-se com as determinações estabelecidas no Plano Estratégico da Justiça Federal da 1ª Região – Planest 2021-2026","Em razão da necessidade de proporcionar condições adequadas às pessoas que se utilizam das instalações da Seção Judiciária de Roraima",21,"contratação dos serviços de manutenções preventivas periódicas e corretivas nos aparelhos condicionadores de ar","2771",null,432,85422.58,"SIM","2023-03-31","12 Meses","SIM","Licitação",3,"Gradualmente, a Seccional vem substituindo os aparelhos condicionadores de ar por equipamentos que possuem tecnologia inverter, que consomem menos energia elétrica","Prejuízo à realização das tarefas rotineiras das áreas meio e fim, com impactos negativos na produtividade"]
["SESEG - 15712415","Aquisição de peças para aparelhos condicionadores de ar,","Alinha-se com as determinações estabelecidas no Plano Estratégico da Justiça Federal da 1ª Região – Planest 2021-2026","Em razão da necessidade de proporcionar condições adequadas às pessoas que se utilizam das instalações da Seção Judiciária de Roraima",21,"Aquisição de peças para aparelhos condicionadores de ar,",null,null,118,14328.37,"SIM","2023-02-28","12 Meses","SIM","Licitação",3,"Gradualmente, estamos substituindo os nossos equipamentos condicionadores de ar por aparelhos que funcionem à base de gás R410A, que é chamado de ecológico porque não possui CFCs (clorofluorcarbonos)","Prejuízo à realização das tarefas rotineiras das áreas meio e fim, com impactos negativos na produtividade"]
["SESEG - 15713211","Aquisição de  Bateria selada regulada por válvula, estacionária 45Ah, 12V.","Alinha-se com as determinações estabelecidas no Plano Estratégico da Justiça Federal da 1ª Região – Planest 2021-2026","Continuidade dos Serviços Públicos, assegurando aos usuários da Seção Judiciária de Roraima uma prestação jurisdicional de forma contínua",1,"Aquisição de  Bateria selada regulada por válvula, estacionária 45Ah, 12V.","429349",null,32,18688,"SIM","2023-06-30","12 Meses","SIM","Licitação",4,"Só será admitida a oferta de baterias cuja composição respeite os limites máximos de chumbo, cádmio e mercúrio admitidos na Resolução CONAMA n° 401, de 04/11/2008","Interrupção total dos sistemas informatizados"]
["SESEG - 15713330","Aquisição de materiais elétrico/hidráulico","Alinha-se com as determinações estabelecidas no Plano Estratégico da Justiça Federal da 1ª Região – Planest 2021-2026","Garantir o pleno funcionamento dos sistemas prediais e reduzir a probabilidade de falhas e/ou degradação das instalações físicas da Seccional, através de serviços de reparos e consertos",17,"Aquisição de materiais elétrico/hidráulico",null,null,717,17683.45,"SIM","2023-09-30","12 Meses","SIM","Licitação",3,"No caso específico das lâmpadas, optou-se pelas de led, que consomem menos energia elétrica e têm uma maior longevidade","Riscos à segurança e bem-estar dos servidores, terceirizados e usuários das instalações da Seção Judiciária de Roraima em decorrência de um ambiente com instalações prediais inadequadas à prestação jurisdicionais"]
["SESEG - 15713366","Aquisição de materiais de copa e cozinha","Alinha-se com as determinações estabelecidas no Plano Estratégico da Justiça Federal da 1ª Região – Planest 2021-2026","Devido à  necessidade de se preparar e servir gêneros alimentícios para eventos tais como júris, conciliações, audiências, etc., faz-se necessária a aquisição dos itens",14,"Aquisição de materiais de copa e cozinha",null,null,616,10754,"SIM","2023-09-30","12 Meses","SIM","Licitação",2,"Em relação aos copos descartáveis, não se optou por materiais biodegradáveis pois o custo dos mesmos são elevados quando comparados aos descartáveis e, no momento atual, torna-se inviável a aquisição","Prejuízo à realização das tarefas rotineiras das áreas meio e fim, com impactos negativos na produtividade"]
["SESEG - 15713404","Prestação de serviços de áudio e vídeo que objetive o registro de Sessão de julgamento do Tribunal de Júri Federal da Justiça Federal de 1ª Instância – Seção Judiciária de Roraima.","Alinha-se com as determinações estabelecidas no Plano Estratégico da Justiça Federal da 1ª Região – Planest 2021-2026","Em decorrência da ausência de profissional técnico capacitado para a operacionalização dos serviços de sonorização e vídeo, bem como da carência de equipamentos adequados para a gravação das seções do Tribunal de Júri",1,"Prestação de serviços de áudio e vídeo que objetive o registro de Sessão de julgamento do Tribunal de Júri Federal da Justiça Federal de 1ª Instância – Seção Judiciária de Roraima","13749",null,3,13500,"SIM","2023-06-30","12 Meses","NÃO","Dispensa",3,null,"Prejuízo à realização das tarefas rotineiras das áreas meio e fim, com impactos negativos na produtividade"]
["SESEG - 15713439","Hospedagem para os participantes de Sessões do Tribunal do Júri","Alinha-se com as determinações estabelecidas no Plano Estratégico da Justiça Federal da 1ª Região – Planest 2021-2026","Uma vez que as Sessões do Tribunal do Júri têm possibilidade de se entender por mais de 1(um) dia, há a necessidade de se efetuar a contratação em tela para que seja garantida a incomunicabilidade de jurados e testemunhas",2,"Hospedagem para os participantes de Sessões do Tribunal do Júri","9946",null,18,5550,"SIM","2023-06-30","12 Meses","NÃO","Dispensa",3,null,"Prejuízo à realização das tarefas rotineiras das áreas meio e fim, com impactos negativos na produtividade"]
["SESEG - 15713478","Fornecimento de refeições do tipo almoço, jantar, lanches, a serem servidas para os participantes de Sessões do Tribunal do Júri","Alinha-se com as determinações estabelecidas no Plano Estratégico da Justiça Federal da 1ª Região – Planest 2021-2026","Uma vez que a duração das Sessões do Tribunal do Júri é imprecisa, podendo se estender por vários dias",2,"Fornecimento de refeições do tipo almoço, jantar, lanches, a serem servidas para os participantes de Sessões do Tribunal do Júri","3697",null,300,6750,"SIM","2023-06-30","12 Meses","SIM","Dispensa",3,null,"Prejuízo à realização das tarefas rotineiras das áreas meio e fim, com impactos negativos na produtividade"]
["SEDER - 16594403","Capacitações para exercício de 2023, com base no Levantamento de Necessidade de Capacitação, Matriz de Planejamento e Plano de Capacitação 2023 da SJRR.","Alinha-se, dentre outras, com a Res. Presi 6903944, de 19/12/2018, que institui a Política de Gestão de Pessoas no âmbito da Justiça Federal da 1ª Região.","A necessidade de desenvolvimento dos servidores para assegurar o constante aprimoramento das equipes de trabalho, buscando mais eficiência na atuação da Justiça.","N/A","Capacitações de serviodres para exercício de 2023.",null,null,55,60000,"NÃO","2022-09-30","30 dias","SIM","Dispensa",4,"Serão priorizadas as ações de capacitação realizadas à distância por meio do aplicativo Teams, Zoom ou Moodle para evitar o deslocamento de servidores, deslocamento em grandes distâncias, consumo de papel com materiais impressos, etc"]

{"sheet":"CAC","index":2,"n_rows":53,"n_cols":32,"rows_kept":53,"cut":false,"hidden":false,"merged":[[1,2,1,28],[2,0,2,6],[3,12,3,14],[3,15,3,17],[3,22,4,22],[3,23,4,23],[3,28,4,28],[3,7,4,7],[3,8,4,8],[3,10,4,10],[3,0,4,0],[3,3,4,3],[3,2,4,2],[3,1,4,1],[3,5,4,5],[3,21,4,21],[3,6,4,6],[3,27,4,27],[2,7,2,21],[2,22,2,28],[3,20,4,20],[3,18,4,18],[3,11,4,11],[3,19,4,19],[3,9,4,9]]}
[null,null,"UG N°","ANO"]
[null,null,"CRONOGRAMA ANUAL DE EXECUÇÃO DAS CONTRATAÇÕES – CAC"]
["Dados do DOD",null,null,null,null,null,null,"Definição de Tempo das Etapas",null,null,null,null,null,null,null,null,null,null,null,null,null,null,"Datas Limites de Conclusão das Fases Intermediárias"]
["Unidade Requisitante\n(informar ID do DOD)","Objeto","PAE - SEI\n(informar nº do processo de contratação, quando autuado)","Data-limite para entrega dos bens ou início da prestação dos serviços",null,"Valor total estimado","Forma de Contratação","Contrato ou Nota de empenho?\n(C/N)","Seleção com Amostra?\n(S/N)","Qtd de Itens do Objeto","TApETP\n(dias)","TElabTR\n(dias)","Licitação",null,null,"Dispensa/inexigibilidade",null,null,"Prorrogação/  renovação","TElabCont/ NE\n(dias)","Recesso forense \n2021/22","TOTAL TEMPO DIAS","Dt entrega ETP","Dt entrega TR/PB","Aprovação do Termo de Referência \n(licitação)","Publicação do Edital\n(licitação)","Homologação do Resultado\n(licitação)","Procedimentos de prorrogação/ renovação","Dt Contratação"]
[null,null,null,null,"Prazo estimado para execução e pagamento total da despesa",null,null,null,null,null,null,null,"TApTR\n(dias)","TFILi\n(dias)","TFELi\n(dias)","TFICD\n(dias)","Instrução processual","Autorização da contratação",null,null,null,null,null,null,"Conclusão Fase Interna da Contratação Direta\n(disp./inexig.)","Despacho Instrução Processual \n(disp./inexig.)","Autorização da contratação \n(disp./inexig.)"]
[{"$f":"PAC!A2","v":"SEVIT - 15317159"},{"$f":"IFERROR(VLOOKUP(A6,PAC!$A$2:$R$4981,2,0),\"\")","v":"Lavagem de veículos para os veículos oficiais da Seção Judiciária de Roraima."},null,{"$f":"IFERROR(VLOOKUP(A6,PAC!$A$2:$R$4981,12,0),\"\")","v":"2023-03-01"},{"$f":"VLOOKUP(A6,PAC!$A$2:$R$4981,17,0)","v":"Utilização de produtos que agridam o meio-ambiente; Utilização de métodos que evitem o desperdício de água tratada, conforme Dec n. 48.138/2003."},{"$f":"IFERROR(VLOOKUP(A6,PAC!$A$2:$R$4981,10,0),\"\")","v":2010},{"$f":"IFERROR(VLOOKUP(A6,PAC!$A$2:$R$4981,15,0),\"\")","v":"Dispensa"},"C","N",{"$f":"SUMIF(PAC!$A$2:$A$4983,A6,PAC!$E$2:$E$4986)","v":6},{"$f":"IF(OR(G6=\"dispensa\",G6=\"inexigibilidade\",G6=\"licitação\"),15,\"0\")","v":15},{"$f":"IF(OR(G6=\"dispensa\",G6=\"inexigibilidade\",G6=\"licitação\"),10,\"0\")","v":10},{"$f":"IF(AND(G6=\"Licitação\"),IF(AND(H6=\"\"),0,IF(AND(H6=\"N\"),AE6,IF(AND(H6=\"C\"),AF6))),\"0\")","v":"0"},{"$f":"IF(AND(G6=\"Licitação\"),IF(AND(H6=\"\"),\"0\",IF(AND(H6=\"N\"),15,IF(AND(H6=\"C\"),25))),\"0\")","v":"0"},{"$f":"IF(AND(G6=\"Licitação\"),IF(AND(I6=\"\"),\"0\",IF(AND(I6=\"N\"),25,IF(AND(I6=\"S\"),40))),\"0\")","v":"0"},{"$f":"IF(OR(G6=\"dispensa\",G6=\"inexigibilidade\"),IF(AND(J6=0),0,IF(AND(J6>0,J6<11),35,IF(AND(J6>10,J6<21),45,IF(AND(J6>20),60)))),\"0\")","v":35},{"$f":"IF(OR(G6=\"dispensa\",G6=\"inexigibilidade\"),3,\"0\")","v":3},{"$f":"IF(OR(G6=\"dispensa\",G6=\"inexigibilidade\"),3,\"0\")","v":3},{"$f":"IF(OR(G6=\"prorrogação\",G6=\"renovação\"),60,\"0\")","v":"0"},{"$f":"IF(OR(G6=\"dispensa\",G6=\"inexigibilidade\",G6=\"licitação\"),IF(AND(H6=\"C\"),5,IF(AND(H6=\"N\"),3,IF(AND(H6=\"\"),\"0\"))),\"0\")","v":5},{"$f":"IF(D6>44549,18,\"0\")","v":18},{"$f":"SUM(K6:U6)","v":89},{"$f":"IF(AND($G6=\"licitação\"),$D6-$V6,IF(AND($G6=\"dispensa\"),$D6-$V6,IF(AND($G6=\"inexigibilidade\"),$D6-$V6,IF(AND($G6=\"renovação\"),\"---\",IF(AND($G6=\"prorrogação\"),\"---\",IF(AND($G6=\"\"),\"---\"))))))","v":"2022-12-02"},{"$f":"IF(AND($G6=\"licitação\"),$W6+$K6+$L6,IF(AND($G6=\"dispensa\"),$W6+$K6+$L6,IF(AND($G6=\"inexigibilidade\"),$W6+$K6+$L6,IF(AND($G6=\"renovação\"),\"---\",IF(AND($G6=\"prorrogação\"),\"---\",IF(AND($G6=\"\"),\"---\"))))))","v":"2022-12-27"},{"$f":"IF(AND($G6=\"licitação\"),$X6+$M6,IF(AND($G6=\"dispensa\"),$X6+$P6,IF(AND($G6=\"inexigibilidade\"),$X6+$P6,IF(AND($G6=\"prorrogação\"),\"---\",IF(AND($G6=\"renovação\"),\"---\",IF(AND($G6=\"\"),\"---\"))))))","v":"2023-01-31"},{"$f":"IF(AND($G6=\"licitação\"),$Y6+$N6,IF(AND($G6=\"dispensa\"),$Y6+$Q6,IF(AND($G6=\"inexigibilidade\"),$Y6+$Q6,IF(AND($G6=\"prorrogação\"),\"---\",IF(AND($G6=\"renovação\"),\"---\",IF(AND($G6=\"\"),\"---\"))))))","v":"2023-02-03"},{"$f":"IF(AND($G6=\"licitação\"),$Z6+$O6,IF(AND($G6=\"dispensa\"),$Z6+$R6,IF(AND($G6=\"inexigibilidade\"),$Z6+$R6,IF(AND($G6=\"prorrogação\"),\"---\",IF(AND($G6=\"renovação\"),\"---\",IF(AND($G6=\"\"),\"---\"))))))","v":"2023-02-06"},{"$f":"IF(AND($G6=\"licitação\"),\"---\",IF(AND($G6=\"dispensa\"),\"---\",IF(AND($G6=\"inexigibilidade\"),\"---\",IF(AND($G6=\"renovação\"),$D6-$V6,IF(AND($G6=\"prorrogação\"),$D6-$V6,IF(AND($G6=\"\"),\"---\"))))))","v":"---"},{"$f":"IF(AND($G6=\"licitação\"),AA6+T6,IF(AND($G6=\"dispensa\"),AA6+T6,IF(AND($G6=\"inexigibilidade\"),AA6+T6,IF(AND($G6=\"renovação\"),$AB6+$S6,IF(AND($G6=\"prorrogação\"),$AB6+$S6,IF(AND($G6=\"\"),\"---\"))))))","v":"2023-02-11"},{"$f":"IFERROR(IF(OR(G6=\"dispensa\",G6=\"inexigibilidade\",G6=\"licitação\"),IF(AND(W6<44568,AC6>44549),\"Atenção!Há recesso forense no período! Fazer ajuste manual de datas, se for o caso.\",\"\"),IF(OR(G6=\"prorrogação\",G6=\"renovação\"),(IF(AND(AB6<44568,AC6>44549),\"Atenção!Há recesso forense no período! Fazer ajuste manual de datas, se for o caso.\")),\"\")),\"\")","v":""},{"$f":"IF(AND(H6=\"N\",J6=1),20,IF(AND(H6=\"N\",J6>1,J6<6),30,IF(AND(H6=\"N\",J6>5,J6<16),45,IF(AND(H6=\"N\",J6>15),70))))","v":false},{"$f":"IF(AND(H6=\"C\",J6=1),40,IF(AND(H6=\"C\",J6>1,J6<6),50,IF(AND(H6=\"C\",J6>5,J6<16),75,IF(AND(H6=\"C\",J6>15),100))))","v":75}]
[{"$f":"PAC!A3","v":"SEVIT - 15317179"},{"$f":"IFERROR(VLOOKUP(A7,PAC!$A$2:$R$4981,2,0),\"\")","v":"Serviços de manutenção preventiva e corretiva a serem executados nos veículos oficiais pertencentes à SJRR."},null,{"$f":"IFERROR(VLOOKUP(A7,PAC!$A$2:$R$4981,12,0),\"\")","v":"2023-03-30"},{"$f":"VLOOKUP(A7,PAC!$A$2:$R$4981,17,0)","v":"Destinação adequada de óleos lubrificantes para evitar contaminação do meio-ambiente."},{"$f":"IFERROR(VLOOKUP(A7,PAC!$A$2:$R$4981,10,0),\"\")","v":6750},{"$f":"IFERROR(VLOOKUP(A7,PAC!$A$2:$R$4981,15,0),\"\")","v":"Dispensa"},"C","N",{"$f":"SUMIF(PAC!$A$2:$A$4983,A7,PAC!$E$2:$E$4986)","v":1},{"$f":"IF(OR(G7=\"dispensa\",G7=\"inexigibilidade\",G7=\"licitação\"),15,\"0\")","v":15},{"$f":"IF(OR(G7=\"dispensa\",G7=\"inexigibilidade\",G7=\"licitação\"),10,\"0\")","v":10},{"$f":"IF(AND(G7=\"Licitação\"),IF(AND(H7=\"\"),0,IF(AND(H7=\"N\"),AE7,IF(AND(H7=\"C\"),AF7))),\"0\")","v":"0"},{"$f":"IF(AND(G7=\"Licitação\"),IF(AND(H7=\"\"),\"0\",IF(AND(H7=\"N\"),15,IF(AND(H7=\"C\"),25))),\"0\")","v":"0"},"0",35,3,3,"0",5,18,89,{"$f":"IF(AND($G7=\"licitação\"),$D7-$V7,IF(AND($G7=\"dispensa\"),$D7-$V7,IF(AND($G7=\"inexigibilidade\"),$D7-$V7,IF(AND($G7=\"renovação\"),\"---\",IF(AND($G7=\"prorrogação\"),\"---\",IF(AND($G7=\"\"),\"---\"))))))","v":"2022-12-31"},{"$f":"IF(AND($G7=\"licitação\"),$W7+$K7+$L7,IF(AND($G7=\"dispensa\"),$W7+$K7+$L7,IF(AND($G7=\"inexigibilidade\"),$W7+$K7+$L7,IF(AND($G7=\"renovação\"),\"---\",IF(AND($G7=\"prorrogação\"),\"---\",IF(AND($G7=\"\"),\"---\"))))))","v":"2023-01-25"},{"$f":"IF(AND($G7=\"licitação\"),$X7+$M7,IF(AND($G7=\"dispensa\"),$X7+$P7,IF(AND($G7=\"inexigibilidade\"),$X7+$P7,IF(AND($G7=\"prorrogação\"),\"---\",IF(AND($G7=\"renovação\"),\"---\",IF(AND($G7=\"\"),\"---\"))))))","v":"2023-03-01"},{"$f":"IF(AND($G7=\"licitação\"),$Y7+$N7,IF(AND($G7=\"dispensa\"),$Y7+$Q7,IF(AND($G7=\"inexigibilidade\"),$Y7+$Q7,IF(AND($G7=\"prorrogação\"),\"---\",IF(AND($G7=\"renovação\"),\"---\",IF(AND($G7=\"\"),\"---\"))))))","v":"2023-03-04"},{"$f":"IF(AND($G7=\"licitação\"),$Z7+$O7,IF(AND($G7=\"dispensa\"),$Z7+$R7,IF(AND($G7=\"inexigibilidade\"),$Z7+$R7,IF(AND($G7=\"prorrogação\"),\"---\",IF(AND($G7=\"renovação\"),\"---\",IF(AND($G7=\"\"),\"---\"))))))","v":"2023-03-07"},{"$f":"IF(AND($G7=\"licitação\"),\"---\",IF(AND($G7=\"dispensa\"),\"---\",IF(AND($G7=\"inexigibilidade\"),\"---\",IF(AND($G7=\"renovação\"),$D7-$V7,IF(AND($G7=\"prorrogação\"),$D7-$V7,IF(AND($G7=\"\"),\"---\"))))))","v":"---"},"2023-03-12","",false,40]
[{"$f":"PAC!A4","v":"SEVIT - 15317201"},{"$f":"IFERROR(VLOOKUP(A8,PAC!$A$2:$R$4981,2,0),\"\")","v":"Fornecimento de combustíveis (gasolina comum, óleo diesel comum, óleo diesel S10 e etanol), destinados ao abastecimento dos veículos oficiais e do grupo gerador de energia elétrica da Justiça Federal de Primeira Instância - Seção Judiciária de Roraima"},null,{"$f":"IFERROR(VLOOKUP(A8,PAC!$A$2:$R$4981,12,0),\"\")","v":"2023-04-30"},{"$f":"VLOOKUP(A8,PAC!$A$2:$R$4981,17,0)","v":"Fornecedor deverá constar do Cadastro Técnico Federal de Atividades Potencialmente Poluidoras e Utilizadoras de Recursos Ambientais – CTF/APP"},{"$f":"IFERROR(VLOOKUP(A8,PAC!$A$2:$R$4981,10,0),\"\")","v":8872},{"$f":"IFERROR(VLOOKUP(A8,PAC!$A$2:$R$4981,15,0),\"\")","v":"Licitação"},"C","N",{"$f":"SUMIF(PAC!$A$2:$A$4983,A8,PAC!$E$2:$E$4986)","v":4},15,10,50,25,25,"0","0","0","0",5,18,148,{"$f":"IF(AND($G8=\"licitação\"),$D8-$V8,IF(AND($G8=\"dispensa\"),$D8-$V8,IF(AND($G8=\"inexigibilidade\"),$D8-$V8,IF(AND($G8=\"renovação\"),\"---\",IF(AND($G8=\"prorrogação\"),\"---\",IF(AND($G8=\"\"),\"---\"))))))","v":"2022-12-03"},{"$f":"IF(AND($G8=\"licitação\"),$W8+$K8+$L8,IF(AND($G8=\"dispensa\"),$W8+$K8+$L8,IF(AND($G8=\"inexigibilidade\"),$W8+$K8+$L8,IF(AND($G8=\"renovação\"),\"---\",IF(AND($G8=\"prorrogação\"),\"---\",IF(AND($G8=\"\"),\"---\"))))))","v":"2022-12-28"},{"$f":"IF(AND($G8=\"licitação\"),$X8+$M8,IF(AND($G8=\"dispensa\"),$X8+$P8,IF(AND($G8=\"inexigibilidade\"),$X8+$P8,IF(AND($G8=\"prorrogação\"),\"---\",IF(AND($G8=\"renovação\"),\"---\",IF(AND($G8=\"\"),\"---\"))))))","v":"2023-02-16"},{"$f":"IF(AND($G8=\"licitação\"),$Y8+$N8,IF(AND($G8=\"dispensa\"),$Y8+$Q8,IF(AND($G8=\"inexigibilidade\"),$Y8+$Q8,IF(AND($G8=\"prorrogação\"),\"---\",IF(AND($G8=\"renovação\"),\"---\",IF(AND($G8=\"\"),\"---\"))))))","v":"2023-03-13"},{"$f":"IF(AND($G8=\"licitação\"),$Z8+$O8,IF(AND($G8=\"dispensa\"),$Z8+$R8,IF(AND($G8=\"inexigibilidade\"),$Z8+$R8,IF(AND($G8=\"prorrogação\"),\"---\",IF(AND($G8=\"renovação\"),\"---\",IF(AND($G8=\"\"),\"---\"))))))","v":"2023-04-07"},{"$f":"IF(AND($G8=\"licitação\"),\"---\",IF(AND($G8=\"dispensa\"),\"---\",IF(AND($G8=\"inexigibilidade\"),\"---\",IF(AND($G8=\"renovação\"),$D8-$V8,IF(AND($G8=\"prorrogação\"),$D8-$V8,IF(AND($G8=\"\"),\"---\"))))))","v":"---"},"2023-04-12","",false,50]
[{"$f":"PAC!A5","v":"SEVIT - 15317489"},{"$f":"IFERROR(VLOOKUP(A9,PAC!$A$2:$R$4981,2,0),\"\")","v":"Serviços de manutenção preventiva e corretiva de Porta Giratória Detector de Metais."},null,{"$f":"IFERROR(VLOOKUP(A9,PAC!$A$2:$R$4981,12,0),\"\")","v":"2023-06-07"},{"$f":"VLOOKUP(A9,PAC!$A$2:$R$4981,17,0)","v":0},{"$f":"IFERROR(VLOOKUP(A9,PAC!$A$2:$R$4981,10,0),\"\")","v":5500},{"$f":"IFERROR(VLOOKUP(A9,PAC!$A$2:$R$4981,15,0),\"\")","v":"Prorrogação"},"C","N",{"$f":"SUMIF(PAC!$A$2:$A$4983,A9,PAC!$E$2:$E$4986)","v":2},"0","0","0","0","0","0","0","0",60,"0",18,78,{"$f":"IF(AND($G9=\"licitação\"),$D9-$V9,IF(AND($G9=\"dispensa\"),$D9-$V9,IF(AND($G9=\"inexigibilidade\"),$D9-$V9,IF(AND($G9=\"renovação\"),\"---\",IF(AND($G9=\"prorrogação\"),\"---\",IF(AND($G9=\"\"),\"---\"))))))","v":"---"},{"$f":"IF(AND($G9=\"licitação\"),$W9+$K9+$L9,IF(AND($G9=\"dispensa\"),$W9+$K9+$L9,IF(AND($G9=\"inexigibilidade\"),$W9+$K9+$L9,IF(AND($G9=\"renovação\"),\"---\",IF(AND($G9=\"prorrogação\"),\"---\",IF(AND($G9=\"\"),\"---\"))))))","v":"---"},{"$f":"IF(AND($G9=\"licitação\"),$X9+$M9,IF(AND($G9=\"dispensa\"),$X9+$P9,IF(AND($G9=\"inexigibilidade\"),$X9+$P9,IF(AND($G9=\"prorrogação\"),\"---\",IF(AND($G9=\"renovação\"),\"---\",IF(AND($G9=\"\"),\"---\"))))))","v":"---"},{"$f":"IF(AND($G9=\"licitação\"),$Y9+$N9,IF(AND($G9=\"dispensa\"),$Y9+$Q9,IF(AND($G9=\"inexigibilidade\"),$Y9+$Q9,IF(AND($G9=\"prorrogação\"),\"---\",IF(AND($G9=\"renovação\"),\"---\",IF(AND($G9=\"\"),\"---\"))))))","v":"---"},{"$f":"IF(AND($G9=\"licitação\"),$Z9+$O9,IF(AND($G9=\"dispensa\"),$Z9+$R9,IF(AND($G9=\"inexigibilidade\"),$Z9+$R9,IF(AND($G9=\"prorrogação\"),\"---\",IF(AND($G9=\"renovação\"),\"---\",IF(AND($G9=\"\"),\"---\"))))))","v":"---"},{"$f":"IF(AND($G9=\"licitação\"),\"---\",IF(AND($G9=\"dispensa\"),\"---\",IF(AND($G9=\"inexigibilidade\"),\"---\",IF(AND($G9=\"renovação\"),$D9-$V9,IF(AND($G9=\"prorrogação\"),$D9-$V9,IF(AND($G9=\"\"),\"---\"))))))","v":"2023-03-21"},"2023-05-20",false,false,50]
[{"$f":"PAC!A6","v":"SEVIT - 15342869"},{"$f":"IFERROR(VLOOKUP(A10,PAC!$A$2:$R$4981,2,0),\"\")","v":"Serviços de seguro automotivo para os veículos oficiais que integram a frota da SJRR."},null,{"$f":"IFERROR(VLOOKUP(A10,PAC!$A$2:$R$4981,12,0),\"\")","v":"2023-06-07"},{"$f":"VLOOKUP(A10,PAC!$A$2:$R$4981,17,0)","v":"Observância da legislação atinente às melhores práticas de sustentabilidade ambiental no âmbito das contratações públicas."},{"$f":"IFERROR(VLOOKUP(A10,PAC!$A$2:$R$4981,10,0),\"\")","v":7123},{"$f":"IFERROR(VLOOKUP(A10,PAC!$A$2:$R$4981,15,0),\"\")","v":"Dispensa"},"C","N",{"$f":"SUMIF(PAC!$A$2:$A$4983,A10,PAC!$E$2:$E$4986)","v":1},15,10,"0","0","0",35,3,3,"0",5,18,89,"2023-03-10","2023-04-04","2023-05-09","2023-05-12","2023-05-15","---","2023-05-20","",false,40]
[{"$f":"PAC!A7","v":"SEVIT - 15343725"},{"$f":"IFERROR(VLOOKUP(A11,PAC!$A$2:$R$4981,2,0),\"\")","v":"Contratar ou firmar convênio com instituições de segurança pública, para realização de Curso de Treinamento de Tiro, para os servidores, Agentes da Polícia Judicial, aptos a portar arma de fogo da Seção Judiciária de Roraima."},null,{"$f":"IFERROR(VLOOKUP(A11,PAC!$A$2:$R$4981,12,0),\"\")","v":"2023-08-30"},{"$f":"VLOOKUP(A11,PAC!$A$2:$R$4981,17,0)","v":"Descarte correto dos materiais empregados no curso"},{"$f":"IFERROR(VLOOKUP(A11,PAC!$A$2:$R$4981,10,0),\"\")","v":4500},{"$f":"IFERROR(VLOOKUP(A11,PAC!$A$2:$R$4981,15,0),\"\")","v":"Dispensa"},"C","N",{"$f":"SUMIF(PAC!$A$2:$A$4983,A11,PAC!$E$2:$E$4986)","v":1},15,10,"0","0","0",35,3,3,"0",5,18,89,"2023-06-02","2023-06-27","2023-08-01","2023-08-04","2023-08-07","---","2023-08-12","",{"$f":"IF(AND(H11=\"N\",J11=1),20,IF(AND(H11=\"N\",J11>1,J11<6),30,IF(AND(H11=\"N\",J11>5,J11<16),45,IF(AND(H11=\"N\",J11>15),70))))","v":false},40]
[{"$f":"PAC!A8","v":"SEVIT - 15344700"},{"$f":"IFERROR(VLOOKUP(A12,PAC!$A$2:$R$4981,2,0),\"\")","v":"Serviços de vigilância armada e segurança patrimonial 24h, com postos nos principais locais de acesso do edifício-sede da Seção Judiciária de Roraima."},null,{"$f":"IFERROR(VLOOKUP(A12,PAC!$A$2:$R$4981,12,0),\"\")","v":"2023-10-26"},{"$f":"VLOOKUP(A12,PAC!$A$2:$R$4981,17,0)","v":"Promover ações educativas aos seus colaboradores sobre o consumo eficiente de energia elétrica e água"},{"$f":"IFERROR(VLOOKUP(A12,PAC!$A$2:$R$4981,10,0),\"\")","v":295269.36},{"$f":"IFERROR(VLOOKUP(A12,PAC!$A$2:$R$4981,15,0),\"\")","v":"Prorrogação"},"C","N",{"$f":"SUMIF(PAC!$A$2:$A$4983,A12,PAC!$E$2:$E$4986)","v":3},"0","0","0","0","0","0","0","0",60,"0",18,78,"---","---","---","---","---","2023-08-09","2023-10-08",false,false,50]
[{"$f":"PAC!A9","v":"SEVIT - 15344763"},{"$f":"IFERROR(VLOOKUP(A13,PAC!$A$2:$R$4981,2,0),\"\")","v":"Serviços de treinamento (certificação) de atualização e formação de Brigada de Prevenção e Combate a Incêndio."},null,{"$f":"IFERROR(VLOOKUP(A13,PAC!$A$2:$R$4981,12,0),\"\")","v":"2023-10-01"},{"$f":"VLOOKUP(A13,PAC!$A$2:$R$4981,17,0)","v":"Cumprir, no que couber, as exigências do art. 6° da Instrução Norma MPOG n°01, de 19 de janeiro de 2010, que estabelece as práticas de sustentabilidade na execução dos serviços"},{"$f":"IFERROR(VLOOKUP(A13,PAC!$A$2:$R$4981,10,0),\"\")","v":2400},{"$f":"IFERROR(VLOOKUP(A13,PAC!$A$2:$R$4981,15,0),\"\")","v":"Dispensa"},"C","N",{"$f":"SUMIF(PAC!$A$2:$A$4983,A13,PAC!$E$2:$E$4986)","v":1},15,10,"0","0","0",35,3,3,"0",5,18,89,"2023-07-04","2023-07-29","2023-09-02","2023-09-05","2023-09-08","---","2023-09-13","",{"$f":"IF(AND(H13=\"N\",J13=1),20,IF(AND(H13=\"N\",J13>1,J13<6),30,IF(AND(H13=\"N\",J13>5,J13<16),45,IF(AND(H13=\"N\",J13>15),70))))","v":false},40]
[{"$f":"PAC!A10","v":"SEVIT - 15345811"},{"$f":"IFERROR(VLOOKUP(A14,PAC!$A$2:$R$4981,2,0),\"\")","v":"Serviços de recarga e de manutenção dos extintores de incêndio pertencentes à Seção Judiciária de Roraima."},null,{"$f":"IFERROR(VLOOKUP(A14,PAC!$A$2:$R$4981,12,0),\"\")","v":"2023-10-01"},{"$f":"VLOOKUP(A14,PAC!$A$2:$R$4981,17,0)","v":"Adotar boas práticas de otimização de recursos/redução de desperdícios/ menor poluição"},{"$f":"IFERROR(VLOOKUP(A14,PAC!$A$2:$R$4981,10,0),\"\")","v":6250},{"$f":"IFERROR(VLOOKUP(A14,PAC!$A$2:$R$4981,15,0),\"\")","v":"Dispensa"},"C","N",{"$f":"SUMIF(PAC!$A$2:$A$4983,A14,PAC!$E$2:$E$4986)","v":3},15,10,"0","0","0",35,3,3,"0",5,18,89,"2023-07-04","2023-07-29","2023-09-02","2023-09-05","2023-09-08","---","2023-09-13","",{"$f":"IF(AND(H14=\"N\",J14=1),20,IF(AND(H14=\"N\",J14>1,J14<6),30,IF(AND(H14=\"N\",J14>5,J14<16),45,IF(AND(H14=\"N\",J14>15),70))))","v":false},50]
[{"$f":"PAC!A11","v":"SEVIT - 15345982"},{"$f":"IFERROR(VLOOKUP(A15,PAC!$A$2:$R$4981,2,0),\"\")","v":"Serviços de manutenção preventiva e corretiva de Equipamento de Inspeção de Raio X, tipo Scanner, modelo Spectrum 5030."},null,{"$f":"IFERROR(VLOOKUP(A15,PAC!$A$2:$R$4981,12,0),\"\")","v":"2023-11-01"},{"$f":"VLOOKUP(A15,PAC!$A$2:$R$4981,17,0)","v":0},{"$f":"IFERROR(VLOOKUP(A15,PAC!$A$2:$R$4981,10,0),\"\")","v":6800},{"$f":"IFERROR(VLOOKUP(A15,PAC!$A$2:$R$4981,15,0),\"\")","v":"Prorrogação"},"N","N",{"$f":"SUMIF(PAC!$A$2:$A$4983,A15,PAC!$E$2:$E$4986)","v":2},"0","0","0","0","0","0","0","0",60,"0",18,78,"---","---","---","---","---","2023-08-15","2023-10-14",false,{"$f":"IF(AND(H15=\"N\",J15=1),20,IF(AND(H15=\"N\",J15>1,J15<6),30,IF(AND(H15=\"N\",J15>5,J15<16),45,IF(AND(H15=\"N\",J15>15),70))))","v":30},{"$f":"IF(AND(H15=\"C\",J15=1),40,IF(AND(H15=\"C\",J15>1,J15<6),50,IF(AND(H15=\"C\",J15>5,J15<16),75,IF(AND(H15=\"C\",J15>15),100))))","v":false}]
[{"$f":"PAC!A12","v":"SEVIT - 15846451"},{"$f":"IFERROR(VLOOKUP(A16,PAC!$A$2:$R$4981,2,0),\"\")","v":"Uniformes e acessórios de identificação visual, para os Agentes da Polícia Judicial."},null,{"$f":"IFERROR(VLOOKUP(A16,PAC!$A$2:$R$4981,12,0),\"\")","v":"2023-04-01"},{"$f":"VLOOKUP(A16,PAC!$A$2:$R$4981,17,0)","v":"Devem ser utilizados, preferencialmente, produtos menos poluentes e agressivos ao meio ambiente que utilizem tecidos que tenham em sua composição fibras com maior resistência à tração e durabilidade."},{"$f":"IFERROR(VLOOKUP(A16,PAC!$A$2:$R$4981,10,0),\"\")","v":3340},{"$f":"IFERROR(VLOOKUP(A16,PAC!$A$2:$R$4981,15,0),\"\")","v":"Dispensa"},"N","N",{"$f":"SUMIF(PAC!$A$2:$A$4983,A16,PAC!$E$2:$E$4986)","v":4},15,10,"0","0","0",35,3,3,"0",3,18,87,"2023-01-04","2023-01-29","2023-03-05","2023-03-08","2023-03-11","---","2023-03-14","",{"$f":"IF(AND(H16=\"N\",J16=1),20,IF(AND(H16=\"N\",J16>1,J16<6),30,IF(AND(H16=\"N\",J16>5,J16<16),45,IF(AND(H16=\"N\",J16>15),70))))","v":30},false]
[{"$f":"PAC!A13","v":"SECAM - 15328939"},{"$f":"IFERROR(VLOOKUP(A17,PAC!$A$2:$R$4981,2,0),\"\")","v":"Serviços de publicação de editais, avisos e notas oficiais de interesse desta Seccional em jornal local de grande circulação Regional."},null,{"$f":"IFERROR(VLOOKUP(A17,PAC!$A$2:$R$4981,12,0),\"\")","v":"2023-01-01"},{"$f":"VLOOKUP(A17,PAC!$A$2:$R$4981,17,0)","v":"Não recebemos nenhum documento em forma física, apenas digitais, objetivando a redução do uso de papeis, tonners e demais produtos."},{"$f":"IFERROR(VLOOKUP(A17,PAC!$A$2:$R$4981,10,0),\"\")","v":4800},{"$f":"IFERROR(VLOOKUP(A17,PAC!$A$2:$R$4981,15,0),\"\")","v":"Inexigibilidade"},"N","N",{"$f":"SUMIF(PAC!$A$2:$A$4983,A17,PAC!$E$2:$E$4986)","v":1},15,10,"0","0","0",35,3,3,"0",3,18,87,"2022-10-06","2022-10-31","2022-12-05","2022-12-08","2022-12-11","---","2022-12-14","",{"$f":"IF(AND(H17=\"N\",J17=1),20,IF(AND(H17=\"N\",J17>1,J17<6),30,IF(AND(H17=\"N\",J17>5,J17<16),45,IF(AND(H17=\"N\",J17>15),70))))","v":20},false]
[{"$f":"PAC!A14","v":"SECAM - 15732555"},{"$f":"IFERROR(VLOOKUP(A18,PAC!$A$2:$R$4981,2,0),\"\")","v":"Serviços de locação de 04 (quatro) fotocopiadoras, com fornecimento de suprimentos."},null,{"$f":"IFERROR(VLOOKUP(A18,PAC!$A$2:$R$4981,12,0),\"\")","v":"2023-06-26"},{"$f":"VLOOKUP(A18,PAC!$A$2:$R$4981,17,0)","v":"O contrato prevê que o contratado faça a retirada dos cartuchos de tonners usados, para o descarte correto dos mesmos"},{"$f":"IFERROR(VLOOKUP(A18,PAC!$A$2:$R$4981,10,0),\"\")","v":36000},{"$f":"IFERROR(VLOOKUP(A18,PAC!$A$2:$R$4981,15,0),\"\")","v":"Prorrogação"},"C","N",{"$f":"SUMIF(PAC!$A$2:$A$4983,A18,PAC!$E$2:$E$4986)","v":1},"0","0","0","0","0","0","0","0",60,"0",18,78,"---","---","---","---","---","2023-04-09","2023-06-08",false,{"$f":"IF(AND(H18=\"N\",J18=1),20,IF(AND(H18=\"N\",J18>1,J18<6),30,IF(AND(H18=\"N\",J18>5,J18<16),45,IF(AND(H18=\"N\",J18>15),70))))","v":false},{"$f":"IF(AND(H18=\"C\",J18=1),40,IF(AND(H18=\"C\",J18>1,J18<6),50,IF(AND(H18=\"C\",J18>5,J18<16),75,IF(AND(H18=\"C\",J18>15),100))))","v":40}]
[{"$f":"PAC!A15","v":"SECAM - 15732641"},{"$f":"IFERROR(VLOOKUP(A19,PAC!$A$2:$R$4981,2,0),\"\")","v":"Serviços de Telefonia Móvel Pessoal - SMP."},null,{"$f":"IFERROR(VLOOKUP(A19,PAC!$A$2:$R$4981,12,0),\"\")","v":"2023-07-22"},{"$f":"VLOOKUP(A19,PAC!$A$2:$R$4981,17,0)","v":"Não recebemos mais nenhum tipo de documento de forma física, somente digitais, objetivando a economia em papel e demais insumos"},{"$f":"IFERROR(VLOOKUP(A19,PAC!$A$2:$R$4981,10,0),\"\")","v":13052.88},{"$f":"IFERROR(VLOOKUP(A19,PAC!$A$2:$R$4981,15,0),\"\")","v":"Licitação"},"N","N",{"$f":"SUMIF(PAC!$A$2:$A$4983,A19,PAC!$E$2:$E$4986)","v":11},15,10,45,15,25,"0","0","0","0",3,18,131,"2023-03-13","2023-04-07","2023-05-22","2023-06-06","2023-07-01","---","2023-07-04","",45,false]
[{"$f":"PAC!A16","v":"SECAM - 15331353"},{"$f":"IFERROR(VLOOKUP(A20,PAC!$A$2:$R$4981,2,0),\"\")","v":"Serviços de postagens e encomendas da Seção Judiciária de Roraima."},null,{"$f":"IFERROR(VLOOKUP(A20,PAC!$A$2:$R$4981,12,0),\"\")","v":"2022-03-31"},{"$f":"VLOOKUP(A20,PAC!$A$2:$R$4981,17,0)","v":"Não recebemos nenhum documento em forma física, apenas digitais, objetivando a redução do uso de papeis e demais insumos."},{"$f":"IFERROR(VLOOKUP(A20,PAC!$A$2:$R$4981,10,0),\"\")","v":34000},{"$f":"IFERROR(VLOOKUP(A20,PAC!$A$2:$R$4981,15,0),\"\")","v":"Prorrogação"},"C","N",{"$f":"SUMIF(PAC!$A$2:$A$4983,A20,PAC!$E$2:$E$4986)","v":1},"0","0","0","0","0","0","0","0",60,"0",18,78,"---","---","---","---","---","2022-01-12","2022-03-13",false,false,40]
[{"$f":"PAC!A17","v":"SECAM - 15732819"},{"$f":"IFERROR(VLOOKUP(A21,PAC!$A$2:$R$4981,2,0),\"\")","v":" Serviço de Telefonia Fixa Comutada."},null,{"$f":"IFERROR(VLOOKUP(A21,PAC!$A$2:$R$4981,12,0),\"\")","v":"2023-08-28"},{"$f":"VLOOKUP(A21,PAC!$A$2:$R$4981,17,0)","v":"Não recebemos nenhum documento em forma física, apenas digitais, objetivando a redução do uso de papeis e demais insumos"},{"$f":"IFERROR(VLOOKUP(A21,PAC!$A$2:$R$4981,10,0),\"\")","v":3605},{"$f":"IFERROR(VLOOKUP(A21,PAC!$A$2:$R$4981,15,0),\"\")","v":"Licitação"},"N","N",{"$f":"SUMIF(PAC!$A$2:$A$4983,A21,PAC!$E$2:$E$4986)","v":6},15,10,45,15,25,"0","0","0","0",3,18,131,"2023-04-19","2023-05-14","2023-06-28","2023-07-13","2023-08-07","---","2023-08-10","",45,false]
[{"$f":"PAC!A18","v":"SEINF - 15328883"},{"$f":"IFERROR(VLOOKUP(A22,PAC!$A$2:$R$4981,2,0),\"\")","v":"Serviços técnicos especializados para apoio na área de TI para atividades de apoio."},null,{"$f":"IFERROR(VLOOKUP(A22,PAC!$A$2:$R$4981,12,0),\"\")","v":"2023-01-31"},{"$f":"VLOOKUP(A22,PAC!$A$2:$R$4981,17,0)","v":"USO - suporte remoto (menor consumo de energia local)."},{"$f":"IFERROR(VLOOKUP(A22,PAC!$A$2:$R$4981,10,0),\"\")","v":472680},{"$f":"IFERROR(VLOOKUP(A22,PAC!$A$2:$R$4981,15,0),\"\")","v":"Licitação"},"N","N",{"$f":"SUMIF(PAC!$A$2:$A$4983,A22,PAC!$E$2:$E$4986)","v":1},15,10,20,15,25,"0","0","0","0",3,18,106,"2022-10-17","2022-11-11","2022-12-01","2022-12-16","2023-01-10","---","2023-01-13","",20,false]
[{"$f":"PAC!A19","v":"SELIT - 15330055"},{"$f":"IFERROR(VLOOKUP(A23,PAC!$A$2:$R$4981,2,0),\"\")","v":"Fornecimento de Passagem Aérea"},null,{"$f":"IFERROR(VLOOKUP(A23,PAC!$A$2:$R$4981,12,0),\"\")","v":"2023-04-02"},{"$f":"VLOOKUP(A23,PAC!$A$2:$R$4981,17,0)","v":"Todos os procedimentos são realizados de forma eletrônica, utilizando o Sistema de Solicitação de Viagens a Serviço - E-AVS, plataforma desenvolvida especificamente para este fim"},{"$f":"IFERROR(VLOOKUP(A23,PAC!$A$2:$R$4981,10,0),\"\")","v":100000},{"$f":"IFERROR(VLOOKUP(A23,PAC!$A$2:$R$4981,15,0),\"\")","v":"Licitação"},"C","N",{"$f":"SUMIF(PAC!$A$2:$A$4983,A23,PAC!$E$2:$E$4986)","v":2},15,10,50,25,25,"0","0","0","0",5,18,148,"2022-11-05","2022-11-30","2023-01-19","2023-02-13","2023-03-10","---","2023-03-15","",false,50]
[{"$f":"PAC!A20","v":"SELIT - 15330056"},{"$f":"IFERROR(VLOOKUP(A24,PAC!$A$2:$R$4981,2,0),\"\")","v":"Aquisição de assinatura online para a plataforma de pesquisa preços"},null,{"$f":"IFERROR(VLOOKUP(A24,PAC!$A$2:$R$4981,12,0),\"\")","v":"2023-05-31"},null,{"$f":"IFERROR(VLOOKUP(A24,PAC!$A$2:$R$4981,10,0),\"\")","v":10865},{"$f":"IFERROR(VLOOKUP(A24,PAC!$A$2:$R$4981,15,0),\"\")","v":"Dispensa"},"N","N",{"$f":"SUMIF(PAC!$A$2:$A$4983,A24,PAC!$E$2:$E$4986)","v":1},15,10,"0","0","0",35,3,3,"0",3,18,87,"2023-03-05","2023-03-30","2023-05-04","2023-05-07","2023-05-10","---","2023-05-13",null,20,false]
[{"$f":"PAC!A21","v":"SEBES - 15770124"},{"$f":"IFERROR(VLOOKUP(A25,PAC!$A$2:$R$4981,2,0),\"\")","v":"Assistência médica, psicológica e odontológica direta aos magistrados e servidores ativos, inativos, e aos seus dependentes"},null,{"$f":"IFERROR(VLOOKUP(A25,PAC!$A$2:$R$4981,12,0),\"\")","v":"2023-01-28"},null,{"$f":"IFERROR(VLOOKUP(A25,PAC!$A$2:$R$4981,10,0),\"\")","v":298017.71999999997},{"$f":"IFERROR(VLOOKUP(A25,PAC!$A$2:$R$4981,15,0),\"\")","v":"Licitação"},"C","N",{"$f":"SUMIF(PAC!$A$2:$A$4983,A25,PAC!$E$2:$E$4986)","v":4},15,10,50,25,25,"0","0","0","0",5,18,148,"2022-09-02","2022-09-27","2022-11-16","2022-12-11","2023-01-05","---","2023-01-10",null,false,50]
[{"$f":"PAC!A22","v":"SEBES - 15770520"},{"$f":"IFERROR(VLOOKUP(A26,PAC!$A$2:$R$4981,2,0),\"\")","v":"Manutenção preventiva e corretiva dos equipamentos do consultório odontológico da SJRR"},null,{"$f":"IFERROR(VLOOKUP(A26,PAC!$A$2:$R$4981,12,0),\"\")","v":"2023-07-29"},null,{"$f":"IFERROR(VLOOKUP(A26,PAC!$A$2:$R$4981,10,0),\"\")","v":6000},{"$f":"IFERROR(VLOOKUP(A26,PAC!$A$2:$R$4981,15,0),\"\")","v":"Prorrogação"},"N","N",{"$f":"SUMIF(PAC!$A$2:$A$4983,A26,PAC!$E$2:$E$4986)","v":1},{"$f":"IF(OR(G26=\"dispensa\",G26=\"inexigibilidade\",G26=\"licitação\"),15,\"0\")","v":"0"},"0","0","0","0","0","0","0",60,"0",18,78,"---","---","---","---","---","2023-05-12","2023-07-11",null,20,false]
[{"$f":"PAC!A23","v":"SEBES - 15330874"},{"$f":"IFERROR(VLOOKUP(A27,PAC!$A$2:$R$4981,2,0),\"\")","v":"Aquisição de Vacinas para imunização contra a gripe H1N1"},null,{"$f":"IFERROR(VLOOKUP(A27,PAC!$A$2:$R$4981,12,0),\"\")","v":"2023-04-30"},null,{"$f":"IFERROR(VLOOKUP(A27,PAC!$A$2:$R$4981,10,0),\"\")","v":13800},{"$f":"IFERROR(VLOOKUP(A27,PAC!$A$2:$R$4981,15,0),\"\")","v":"Dispensa"},"C","N",{"$f":"SUMIF(PAC!$A$2:$A$4983,A27,PAC!$E$2:$E$4986)","v":1},15,10,"0","0","0",35,3,3,"0",5,18,89,"2023-01-31","2023-02-25","2023-04-01","2023-04-04","2023-04-07","---","2023-04-12",null,false,40]
[{"$f":"PAC!A24","v":"SEBES - 15330879"},{"$f":"IFERROR(VLOOKUP(A28,PAC!$A$2:$R$4981,2,0),\"\")","v":"Materiais e medicamentos para os consultórios médico e odontológico da Seção Judiciária de Roraima"},null,{"$f":"IFERROR(VLOOKUP(A28,PAC!$A$2:$R$4981,12,0),\"\")","v":"2023-07-31"},null,{"$f":"IFERROR(VLOOKUP(A28,PAC!$A$2:$R$4981,10,0),\"\")","v":25902.43},{"$f":"IFERROR(VLOOKUP(A28,PAC!$A$2:$R$4981,15,0),\"\")","v":"Licitação"},"C","N",{"$f":"SUMIF(PAC!$A$2:$A$4983,A28,PAC!$E$2:$E$4986)","v":137},15,10,100,25,25,"0","0","0","0",5,18,198,"2023-01-14","2023-02-08","2023-05-19","2023-06-13","2023-07-08","---","2023-07-13",null,false,100]
[{"$f":"PAC!A25","v":"SEMAP - 15331081"},{"$f":"IFERROR(VLOOKUP(A29,PAC!$A$2:$R$4981,2,0),\"\")","v":"Aquisição de materiais de consumo diversos para consecução das atividades internas na SJRR."},null,{"$f":"IFERROR(VLOOKUP(A29,PAC!$A$2:$R$4981,12,0),\"\")","v":"2023-03-31"},null,{"$f":"IFERROR(VLOOKUP(A29,PAC!$A$2:$R$4981,10,0),\"\")","v":52505},{"$f":"IFERROR(VLOOKUP(A29,PAC!$A$2:$R$4981,15,0),\"\")","v":"Licitação"},"C","N",{"$f":"SUMIF(PAC!$A$2:$A$4983,A29,PAC!$E$2:$E$4986)","v":22},15,10,{"$f":"IF(AND(G29=\"Licitação\"),IF(AND(H29=\"\"),0,IF(AND(H29=\"N\"),AE29,IF(AND(H29=\"C\"),AF29))),\"0\")","v":100},25,25,"0","0","0","0",5,18,198,"2022-09-14","2022-10-09","2023-01-17","2023-02-11","2023-03-08","---","2023-03-13",null,false,100]
[{"$f":"PAC!A26","v":"SESEG - 15770821"},{"$f":"IFERROR(VLOOKUP(A30,PAC!$A$2:$R$4981,2,0),\"\")","v":"Serviços de limpeza, conservação, copeiragem e jardinagem, com fornecimento de material de limpeza e jardinagem."},null,{"$f":"IFERROR(VLOOKUP(A30,PAC!$A$2:$R$4981,12,0),\"\")","v":"2023-01-31"},null,{"$f":"IFERROR(VLOOKUP(A30,PAC!$A$2:$R$4981,10,0),\"\")","v":451521.73},{"$f":"IFERROR(VLOOKUP(A30,PAC!$A$2:$R$4981,15,0),\"\")","v":"Prorrogação"},"C","N",{"$f":"SUMIF(PAC!$A$2:$A$4983,A30,PAC!$E$2:$E$4986)","v":3},"0","0","0","0","0","0","0","0",60,"0",18,78,"---","---","---","---","---","2022-11-14","2023-01-13",null,false,50]
[{"$f":"PAC!A27","v":"SESEG - 15770921"},{"$f":"IFERROR(VLOOKUP(A31,PAC!$A$2:$R$4981,2,0),\"\")","v":"Prestação de serviços continuados de apoio administrativo nas dependências da Seção Judiciária de Roraima"},null,{"$f":"IFERROR(VLOOKUP(A31,PAC!$A$2:$R$4981,12,0),\"\")","v":"2023-01-09"},null,{"$f":"IFERROR(VLOOKUP(A31,PAC!$A$2:$R$4981,10,0),\"\")","v":525433.92000000004},{"$f":"IFERROR(VLOOKUP(A31,PAC!$A$2:$R$4981,15,0),\"\")","v":"Licitação"},"N","N",{"$f":"SUMIF(PAC!$A$2:$A$4983,A31,PAC!$E$2:$E$4986)","v":1},15,10,20,15,25,"0","0","0","0",3,18,106,"2022-09-25","2022-10-20","2022-11-09","2022-11-24","2022-12-19","---","2022-12-22",null,20,false]
[{"$f":"PAC!A28","v":"SESEG - 15771480 "},{"$f":"IFERROR(VLOOKUP(A32,PAC!$A$2:$R$4981,2,0),\"\")","v":"Prestação de serviços continuados de manutenção predial nas dependências da Seção Judiciária de Roraima"},null,{"$f":"IFERROR(VLOOKUP(A32,PAC!$A$2:$R$4981,12,0),\"\")","v":"2023-03-06"},null,{"$f":"IFERROR(VLOOKUP(A32,PAC!$A$2:$R$4981,10,0),\"\")","v":85813.87},{"$f":"IFERROR(VLOOKUP(A32,PAC!$A$2:$R$4981,15,0),\"\")","v":"Prorrogação"},"N","N",{"$f":"SUMIF(PAC!$A$2:$A$4983,A32,PAC!$E$2:$E$4986)","v":1},"0","0","0","0","0","0","0","0",60,"0",18,78,"---","---","---","---","---","2022-12-18","2023-02-16",null,20,false]
[{"$f":"PAC!A29","v":"SESEG - 15771771"},{"$f":"IFERROR(VLOOKUP(A33,PAC!$A$2:$R$4981,2,0),\"\")","v":"Prestação de serviços continuados de manutenção no elevador localizado nas dependências da Seção Judiciária de Roraima"},null,{"$f":"IFERROR(VLOOKUP(A33,PAC!$A$2:$R$4981,12,0),\"\")","v":"2023-05-26"},null,{"$f":"IFERROR(VLOOKUP(A33,PAC!$A$2:$R$4981,10,0),\"\")","v":7560},{"$f":"IFERROR(VLOOKUP(A33,PAC!$A$2:$R$4981,15,0),\"\")","v":"Prorrogação"},"C","N",{"$f":"SUMIF(PAC!$A$2:$A$4983,A33,PAC!$E$2:$E$4986)","v":1},"0","0","0","0","0","0","0","0",60,"0",18,78,"---","---","---","---","---","2023-03-09","2023-05-08",null,false,40]
[{"$f":"PAC!A30","v":"SESEG - 15771816"},{"$f":"IFERROR(VLOOKUP(A34,PAC!$A$2:$R$4981,2,0),\"\")","v":"Prestação de serviços continuados de manutenção em 6(seis) no-breaks prediais localizados nas dependências da Seção Judiciária de Roraima"},null,{"$f":"IFERROR(VLOOKUP(A34,PAC!$A$2:$R$4981,12,0),\"\")","v":"2023-08-31"},null,{"$f":"IFERROR(VLOOKUP(A34,PAC!$A$2:$R$4981,10,0),\"\")","v":34500},{"$f":"IFERROR(VLOOKUP(A34,PAC!$A$2:$R$4981,15,0),\"\")","v":"Prorrogação"},"C","N",{"$f":"SUMIF(PAC!$A$2:$A$4983,A34,PAC!$E$2:$E$4986)","v":1},"0","0","0","0","0","0","0","0",60,"0",18,78,"---","---","---","---","---","2023-06-14","2023-08-13",null,false,40]
[{"$f":"PAC!A31","v":"SESEG - 15771899"},{"$f":"IFERROR(VLOOKUP(A35,PAC!$A$2:$R$4981,2,0),\"\")","v":"Prestação de serviços continuados de fornecimento de energia elétrica para a Seção Judiciária de Roraima"},null,{"$f":"IFERROR(VLOOKUP(A35,PAC!$A$2:$R$4981,12,0),\"\")","v":"2023-06-30"},null,{"$f":"IFERROR(VLOOKUP(A35,PAC!$A$2:$R$4981,10,0),\"\")","v":360000},{"$f":"IFERROR(VLOOKUP(A35,PAC!$A$2:$R$4981,15,0),\"\")","v":"Inexigibilidade"},"C","N",{"$f":"SUMIF(PAC!$A$2:$A$4983,A35,PAC!$E$2:$E$4986)","v":1},15,10,"0","0","0",35,3,3,"0",5,18,89,"2023-04-02","2023-04-27","2023-06-01","2023-06-04","2023-06-07","---","2023-06-12",null,false,40]
[{"$f":"PAC!A32","v":"SESEG - 15771980"},{"$f":"IFERROR(VLOOKUP(A36,PAC!$A$2:$R$4981,2,0),\"\")","v":"Prestação de serviços continuados de abastecimento  de água encanada para a Seção Judiciária de Roraima"},null,{"$f":"IFERROR(VLOOKUP(A36,PAC!$A$2:$R$4981,12,0),\"\")","v":"2023-01-31"},null,{"$f":"IFERROR(VLOOKUP(A36,PAC!$A$2:$R$4981,10,0),\"\")","v":3000},{"$f":"IFERROR(VLOOKUP(A36,PAC!$A$2:$R$4981,15,0),\"\")","v":"Inexigibilidade"},"N","N",{"$f":"SUMIF(PAC!$A$2:$A$4983,A36,PAC!$E$2:$E$4986)","v":1},{"$f":"IF(OR(G36=\"dispensa\",G36=\"inexigibilidade\",G36=\"licitação\"),15,\"0\")","v":15},{"$f":"IF(OR(G36=\"dispensa\",G36=\"inexigibilidade\",G36=\"licitação\"),10,\"0\")","v":10},{"$f":"IF(AND(G36=\"Licitação\"),IF(AND(H36=\"\"),0,IF(AND(H36=\"N\"),AE36,IF(AND(H36=\"C\"),AF36))),\"0\")","v":"0"},{"$f":"IF(AND(G36=\"Licitação\"),IF(AND(H36=\"\"),\"0\",IF(AND(H36=\"N\"),15,IF(AND(H36=\"C\"),25))),\"0\")","v":"0"},{"$f":"IF(AND(G36=\"Licitação\"),IF(AND(I36=\"\"),\"0\",IF(AND(I36=\"N\"),25,IF(AND(I36=\"S\"),40))),\"0\")","v":"0"},{"$f":"IF(OR(G36=\"dispensa\",G36=\"inexigibilidade\"),IF(AND(J36=0),0,IF(AND(J36>0,J36<11),35,IF(AND(J36>10,J36<21),45,IF(AND(J36>20),60)))),\"0\")","v":35},{"$f":"IF(OR(G36=\"dispensa\",G36=\"inexigibilidade\"),3,\"0\")","v":3},{"$f":"IF(OR(G36=\"dispensa\",G36=\"inexigibilidade\"),3,\"0\")","v":3},{"$f":"IF(OR(G36=\"prorrogação\",G36=\"renovação\"),60,\"0\")","v":"0"},{"$f":"IF(OR(G36=\"dispensa\",G36=\"inexigibilidade\",G36=\"licitação\"),IF(AND(H36=\"C\"),5,IF(AND(H36=\"N\"),3,IF(AND(H36=\"\"),\"0\"))),\"0\")","v":3},{"$f":"IF(D36>44549,18,\"0\")","v":18},{"$f":"SUM(K36:U36)","v":87},"2022-11-05","2022-11-30","2023-01-04","2023-01-07","2023-01-10","---",{"$f":"IF(AND($G36=\"licitação\"),AA36+T36,IF(AND($G36=\"dispensa\"),AA36+T36,IF(AND($G36=\"inexigibilidade\"),AA36+T36,IF(AND($G36=\"renovação\"),$AB36+$S36,IF(AND($G36=\"prorrogação\"),$AB36+$S36,IF(AND($G36=\"\"),\"---\"))))))","v":"2023-01-13"},null,20,false]
[{"$f":"PAC!A33","v":"SESEG - 15772019"},{"$f":"IFERROR(VLOOKUP(A37,PAC!$A$2:$R$4981,2,0),\"\")","v":"Prestação de serviço de manutenção no grupo gerador, subestação e USCA localizados nas dependências da Seção Judiciária de Roraima"},null,{"$f":"IFERROR(VLOOKUP(A37,PAC!$A$2:$R$4981,12,0),\"\")","v":"2023-12-08"},null,{"$f":"IFERROR(VLOOKUP(A37,PAC!$A$2:$R$4981,10,0),\"\")","v":31725},{"$f":"IFERROR(VLOOKUP(A37,PAC!$A$2:$R$4981,15,0),\"\")","v":"Prorrogação"},"N","N",{"$f":"SUMIF(PAC!$A$2:$A$4983,A37,PAC!$E$2:$E$4986)","v":1},"0","0","0","0","0","0","0","0",60,"0",18,78,"---","---","---","---","---","2023-09-21","2023-11-20",null,20,false]
[{"$f":"PAC!A34","v":"SESEG - 15772067"},{"$f":"IFERROR(VLOOKUP(A38,PAC!$A$2:$R$4981,2,0),\"\")","v":"Prestação de serviços continuados  de manutenção preventiva/corretiva nos equipamentos que compõem os sistemas de abastecimento d'água e de combate a incêndio localizados nas dependências da Seção Judiciária de Roraima"},null,{"$f":"IFERROR(VLOOKUP(A38,PAC!$A$2:$R$4981,12,0),\"\")","v":"2023-11-03"},null,{"$f":"IFERROR(VLOOKUP(A38,PAC!$A$2:$R$4981,10,0),\"\")","v":12000},{"$f":"IFERROR(VLOOKUP(A38,PAC!$A$2:$R$4981,15,0),\"\")","v":"Prorrogação"},"C","N",{"$f":"SUMIF(PAC!$A$2:$A$4983,A38,PAC!$E$2:$E$4986)","v":1},"0","0","0","0","0","0","0","0",60,"0",18,78,"---","---","---","---","---","2023-08-17","2023-10-16",null,false,40]
[{"$f":"PAC!A35","v":"SESEG - 15711791"},{"$f":"IFERROR(VLOOKUP(A39,PAC!$A$2:$R$4981,2,0),\"\")","v":"Manter o volume de dejetos contidos nas fossas sépticas em níveis aceitáveis, reduzindo-se a possibilidade de transbordamentos; Manter a rede de esgoto desobstruída, evitando-se, assim, transbordamentos e mau cheiro"},null,{"$f":"IFERROR(VLOOKUP(A39,PAC!$A$2:$R$4981,12,0),\"\")","v":"2023-01-31"},null,{"$f":"IFERROR(VLOOKUP(A39,PAC!$A$2:$R$4981,10,0),\"\")","v":7500},{"$f":"IFERROR(VLOOKUP(A39,PAC!$A$2:$R$4981,15,0),\"\")","v":"Dispensa"},"N","N",{"$f":"SUMIF(PAC!$A$2:$A$4983,A39,PAC!$E$2:$E$4986)","v":2},15,10,"0","0","0",35,3,3,"0",3,18,87,"2022-11-05","2022-11-30","2023-01-04","2023-01-07","2023-01-10","---","2023-01-13",null,30,false]
[{"$f":"PAC!A36","v":"SESEG - 15711835"},{"$f":"IFERROR(VLOOKUP(A40,PAC!$A$2:$R$4981,2,0),\"\")","v":"Carga de gás de cozinha (GLP) em botija de 13 quilos"},null,{"$f":"IFERROR(VLOOKUP(A40,PAC!$A$2:$R$4981,12,0),\"\")","v":"2023-01-31"},null,{"$f":"IFERROR(VLOOKUP(A40,PAC!$A$2:$R$4981,10,0),\"\")","v":4500},{"$f":"IFERROR(VLOOKUP(A40,PAC!$A$2:$R$4981,15,0),\"\")","v":"Dispensa"},"N","N",{"$f":"SUMIF(PAC!$A$2:$A$4983,A40,PAC!$E$2:$E$4986)","v":1},15,10,"0","0","0",35,3,3,"0",3,18,87,"2022-11-05","2022-11-30","2023-01-04","2023-01-07","2023-01-10","---","2023-01-13",null,20,false]
[{"$f":"PAC!A37","v":"SESEG - 15711889"},{"$f":"IFERROR(VLOOKUP(A41,PAC!$A$2:$R$4981,2,0),\"\")","v":"Fornecimento de gêneros alimentícios (café, açucar,adoçante, água mineral)"},null,{"$f":"IFERROR(VLOOKUP(A41,PAC!$A$2:$R$4981,12,0),\"\")","v":"2023-03-31"},null,{"$f":"IFERROR(VLOOKUP(A41,PAC!$A$2:$R$4981,10,0),\"\")","v":68944},{"$f":"IFERROR(VLOOKUP(A41,PAC!$A$2:$R$4981,15,0),\"\")","v":"Licitação"},"C","N",{"$f":"SUMIF(PAC!$A$2:$A$4983,A41,PAC!$E$2:$E$4986)","v":6},15,10,75,25,25,"0","0","0","0",5,18,173,"2022-10-09","2022-11-03","2023-01-17","2023-02-11","2023-03-08","---","2023-03-13",null,false,75]
[{"$f":"PAC!A38","v":"SESEG - 15712033"},{"$f":"IFERROR(VLOOKUP(A42,PAC!$A$2:$R$4981,2,0),\"\")","v":"contratação dos serviços de manutenções preventivas periódicas e corretivas nos aparelhos condicionadores de ar"},null,{"$f":"IFERROR(VLOOKUP(A42,PAC!$A$2:$R$4981,12,0),\"\")","v":"2023-03-31"},null,{"$f":"IFERROR(VLOOKUP(A42,PAC!$A$2:$R$4981,10,0),\"\")","v":85422.58},{"$f":"IFERROR(VLOOKUP(A42,PAC!$A$2:$R$4981,15,0),\"\")","v":"Licitação"},"C","N",{"$f":"SUMIF(PAC!$A$2:$A$4983,A42,PAC!$E$2:$E$4986)","v":21},15,10,100,25,25,"0","0","0","0",5,18,198,"2022-09-14","2022-10-09","2023-01-17","2023-02-11","2023-03-08","---","2023-03-13",null,false,100]
[{"$f":"PAC!A39","v":"SESEG - 15712415"},{"$f":"IFERROR(VLOOKUP(A43,PAC!$A$2:$R$4981,2,0),\"\")","v":"Aquisição de peças para aparelhos condicionadores de ar,"},null,{"$f":"IFERROR(VLOOKUP(A43,PAC!$A$2:$R$4981,12,0),\"\")","v":"2023-02-28"},null,{"$f":"IFERROR(VLOOKUP(A43,PAC!$A$2:$R$4981,10,0),\"\")","v":14328.37},{"$f":"IFERROR(VLOOKUP(A43,PAC!$A$2:$R$4981,15,0),\"\")","v":"Licitação"},"C","N",{"$f":"SUMIF(PAC!$A$2:$A$4983,A43,PAC!$E$2:$E$4986)","v":21},15,10,100,25,25,"0","0","0","0",5,18,198,"2022-08-14","2022-09-08","2022-12-17","2023-01-11","2023-02-05","---","2023-02-10",null,false,100]
[{"$f":"PAC!A40","v":"SESEG - 15713211"},{"$f":"IFERROR(VLOOKUP(A44,PAC!$A$2:$R$4981,2,0),\"\")","v":"Aquisição de  Bateria selada regulada por válvula, estacionária 45Ah, 12V."},null,{"$f":"IFERROR(VLOOKUP(A44,PAC!$A$2:$R$4981,12,0),\"\")","v":"2023-06-30"},null,{"$f":"IFERROR(VLOOKUP(A44,PAC!$A$2:$R$4981,10,0),\"\")","v":18688},{"$f":"IFERROR(VLOOKUP(A44,PAC!$A$2:$R$4981,15,0),\"\")","v":"Licitação"},"N","N",{"$f":"SUMIF(PAC!$A$2:$A$4983,A44,PAC!$E$2:$E$4986)","v":1},{"$f":"IF(OR(G44=\"dispensa\",G44=\"inexigibilidade\",G44=\"licitação\"),15,\"0\")","v":15},{"$f":"IF(OR(G44=\"dispensa\",G44=\"inexigibilidade\",G44=\"licitação\"),10,\"0\")","v":10},{"$f":"IF(AND(G44=\"Licitação\"),IF(AND(H44=\"\"),0,IF(AND(H44=\"N\"),AE44,IF(AND(H44=\"C\"),AF44))),\"0\")","v":20},{"$f":"IF(AND(G44=\"Licitação\"),IF(AND(H44=\"\"),\"0\",IF(AND(H44=\"N\"),15,IF(AND(H44=\"C\"),25))),\"0\")","v":15},{"$f":"IF(AND(G44=\"Licitação\"),IF(AND(I44=\"\"),\"0\",IF(AND(I44=\"N\"),25,IF(AND(I44=\"S\"),40))),\"0\")","v":25},{"$f":"IF(OR(G44=\"dispensa\",G44=\"inexigibilidade\"),IF(AND(J44=0),0,IF(AND(J44>0,J44<11),35,IF(AND(J44>10,J44<21),45,IF(AND(J44>20),60)))),\"0\")","v":"0"},{"$f":"IF(OR(G44=\"dispensa\",G44=\"inexigibilidade\"),3,\"0\")","v":"0"},{"$f":"IF(OR(G44=\"dispensa\",G44=\"inexigibilidade\"),3,\"0\")","v":"0"},{"$f":"IF(OR(G44=\"prorrogação\",G44=\"renovação\"),60,\"0\")","v":"0"},{"$f":"IF(OR(G44=\"dispensa\",G44=\"inexigibilidade\",G44=\"licitação\"),IF(AND(H44=\"C\"),5,IF(AND(H44=\"N\"),3,IF(AND(H44=\"\"),\"0\"))),\"0\")","v":3},{"$f":"IF(D44>44549,18,\"0\")","v":18},{"$f":"SUM(K44:U44)","v":106},"2023-03-16","2023-04-10","2023-04-30","2023-05-15","2023-06-09","---",{"$f":"IF(AND($G44=\"licitação\"),AA44+T44,IF(AND($G44=\"dispensa\"),AA44+T44,IF(AND($G44=\"inexigibilidade\"),AA44+T44,IF(AND($G44=\"renovação\"),$AB44+$S44,IF(AND($G44=\"prorrogação\"),$AB44+$S44,IF(AND($G44=\"\"),\"---\"))))))","v":"2023-06-12"},null,20,false]
[{"$f":"PAC!A41","v":"SESEG - 15713330"},{"$f":"IFERROR(VLOOKUP(A45,PAC!$A$2:$R$4981,2,0),\"\")","v":"Aquisição de materiais elétrico/hidráulico"},null,{"$f":"IFERROR(VLOOKUP(A45,PAC!$A$2:$R$4981,12,0),\"\")","v":"2023-09-30"},null,{"$f":"IFERROR(VLOOKUP(A45,PAC!$A$2:$R$4981,10,0),\"\")","v":17683.45},{"$f":"IFERROR(VLOOKUP(A45,PAC!$A$2:$R$4981,15,0),\"\")","v":"Licitação"},"C","N",{"$f":"SUMIF(PAC!$A$2:$A$4983,A45,PAC!$E$2:$E$4986)","v":17},15,10,100,25,25,"0","0","0","0",5,18,198,"2023-03-16","2023-04-10","2023-07-19","2023-08-13","2023-09-07","---","2023-09-12",null,false,100]
[{"$f":"PAC!A42","v":"SESEG - 15713366"},{"$f":"IFERROR(VLOOKUP(A46,PAC!$A$2:$R$4981,2,0),\"\")","v":"Aquisição de materiais de copa e cozinha"},null,{"$f":"IFERROR(VLOOKUP(A46,PAC!$A$2:$R$4981,12,0),\"\")","v":"2023-09-30"},null,{"$f":"IFERROR(VLOOKUP(A46,PAC!$A$2:$R$4981,10,0),\"\")","v":10754},{"$f":"IFERROR(VLOOKUP(A46,PAC!$A$2:$R$4981,15,0),\"\")","v":"Licitação"},"C","N",{"$f":"SUMIF(PAC!$A$2:$A$4983,A46,PAC!$E$2:$E$4986)","v":14},15,10,75,25,25,"0","0","0","0",5,18,173,"2023-04-10","2023-05-05","2023-07-19","2023-08-13","2023-09-07","---","2023-09-12",null,false,75]
[{"$f":"PAC!A43","v":"SESEG - 15713404"},{"$f":"IFERROR(VLOOKUP(A47,PAC!$A$2:$R$4981,2,0),\"\")","v":"Prestação de serviços de áudio e vídeo que objetive o registro de Sessão de julgamento do Tribunal de Júri Federal da Justiça Federal de 1ª Instância – Seção Judiciária de Roraima."},null,{"$f":"IFERROR(VLOOKUP(A47,PAC!$A$2:$R$4981,12,0),\"\")","v":"2023-06-30"},null,{"$f":"IFERROR(VLOOKUP(A47,PAC!$A$2:$R$4981,10,0),\"\")","v":13500},{"$f":"IFERROR(VLOOKUP(A47,PAC!$A$2:$R$4981,15,0),\"\")","v":"Dispensa"},"C","N",{"$f":"SUMIF(PAC!$A$2:$A$4983,A47,PAC!$E$2:$E$4986)","v":1},15,10,"0","0","0",35,3,3,"0",5,18,89,"2023-04-02","2023-04-27","2023-06-01","2023-06-04","2023-06-07","---","2023-06-12",null,false,40]
[{"$f":"PAC!A44","v":"SESEG - 15713439"},{"$f":"IFERROR(VLOOKUP(A48,PAC!$A$2:$R$4981,2,0),\"\")","v":"Hospedagem para os participantes de Sessões do Tribunal do Júri"},null,{"$f":"IFERROR(VLOOKUP(A48,PAC!$A$2:$R$4981,12,0),\"\")","v":"2023-06-30"},null,{"$f":"IFERROR(VLOOKUP(A48,PAC!$A$2:$R$4981,10,0),\"\")","v":5550},{"$f":"IFERROR(VLOOKUP(A48,PAC!$A$2:$R$4981,15,0),\"\")","v":"Dispensa"},"C","N",{"$f":"SUMIF(PAC!$A$2:$A$4983,A48,PAC!$E$2:$E$4986)","v":2},15,10,"0","0","0",35,3,3,"0",5,18,89,"2023-04-02","2023-04-27","2023-06-01","2023-06-04","2023-06-07","---","2023-06-12",null,false,50]
[{"$f":"PAC!A45","v":"SESEG - 15713478"},{"$f":"IFERROR(VLOOKUP(A49,PAC!$A$2:$R$4981,2,0),\"\")","v":"Fornecimento de refeições do tipo almoço, jantar, lanches, a serem servidas para os participantes de Sessões do Tribunal do Júri"},null,{"$f":"IFERROR(VLOOKUP(A49,PAC!$A$2:$R$4981,12,0),\"\")","v":"2023-06-30"},null,{"$f":"IFERROR(VLOOKUP(A49,PAC!$A$2:$R$4981,10,0),\"\")","v":6750},{"$f":"IFERROR(VLOOKUP(A49,PAC!$A$2:$R$4981,15,0),\"\")","v":"Dispensa"},"C","N",{"$f":"SUMIF(PAC!$A$2:$A$4983,A49,PAC!$E$2:$E$4986)","v":2},15,10,"0","0","0",35,3,3,"0",5,18,89,"2023-04-02","2023-04-27","2023-06-01","2023-06-04","2023-06-07","---","2023-06-12",null,false,50]
[{"$f":"PAC!A46","v":"SEDER - 16594403"},{"$f":"IFERROR(VLOOKUP(A50,PAC!$A$2:$R$4981,2,0),\"\")","v":"Capacitações para exercício de 2023, com base no Levantamento de Necessidade de Capacitação, Matriz de Planejamento e Plano de Capacitação 2023 da SJRR."},null,{"$f":"IFERROR(VLOOKUP(A50,PAC!$A$2:$R$4981,12,0),\"\")","v":"2022-09-30"},null,{"$f":"IFERROR(VLOOKUP(A50,PAC!$A$2:$R$4981,10,0),\"\")","v":60000},{"$f":"IFERROR(VLOOKUP(A50,PAC!$A$2:$R$4981,15,0),\"\")","v":"Dispensa"},"N","N",{"$f":"SUMIF(PAC!$A$2:$A$4983,A50,PAC!$E$2:$E$4986)","v":0},15,10,"0","0","0",0,3,3,"0",3,18,52,"2022-08-09","2022-09-03","2022-09-03","2022-09-06","2022-09-09","---","2022-09-12",null,false,false]
[{"$f":"PAC!A49","v":0},{"$f":"IFERROR(VLOOKUP(A51,PAC!$A$2:$R$4981,2,0),\"\")","v":""},null,{"$f":"IFERROR(VLOOKUP(A51,PAC!$A$2:$R$4981,12,0),\"\")","v":""},null,{"$f":"IFERROR(VLOOKUP(A51,PAC!$A$2:$R$4981,10,0),\"\")","v":""},{"$f":"IFERROR(VLOOKUP(A51,PAC!$A$2:$R$4981,15,0),\"\")","v":""},null,null,{"$f":"SUMIF(PAC!$A$2:$A$4983,A51,PAC!$E$2:$E$4986)","v":0},"0","0","0","0","0","0","0","0","0","0",18,18,"---","---","---","---","---","---","---",null,false,false]
[{"$f":"PAC!A50","v":0},{"$f":"IFERROR(VLOOKUP(A52,PAC!$A$2:$R$4981,2,0),\"\")","v":""},null,{"$f":"IFERROR(VLOOKUP(A52,PAC!$A$2:$R$4981,12,0),\"\")","v":""},null,{"$f":"IFERROR(VLOOKUP(A52,PAC!$A$2:$R$4981,10,0),\"\")","v":""},{"$f":"IFERROR(VLOOKUP(A52,PAC!$A$2:$R$4981,15,0),\"\")","v":""},null,null,{"$f":"SUMIF(PAC!$A$2:$A$4983,A52,PAC!$E$2:$E$4986)","v":0},"0","0","0","0","0","0","0","0","0","0",18,18,"---","---","---","---","---","---","---",null,false,false]
[{"$f":"PAC!A51","v":0},{"$f":"IFERROR(VLOOKUP(A53,PAC!$A$2:$R$4981,2,0),\"\")","v":""},null,{"$f":"IFERROR(VLOOKUP(A53,PAC!$A$2:$R$4981,12,0),\"\")","v":""},null,{"$f":"IFERROR(VLOOKUP(A53,PAC!$A$2:$R$4981,10,0),\"\")","v":""},{"$f":"IFERROR(VLOOKUP(A53,PAC!$A$2:$R$4981,15,0),\"\")","v":""},null,null,{"$f":"SUMIF(PAC!$A$2:$A$4983,A53,PAC!$E$2:$E$4986)","v":0},"0","0","0","0","0","0","0","0","0","0",18,18,"---","---","---","---","---","---","---",null,false,false]

{"sheet":"CAC - Acompanhamento","index":3,"n_rows":300,"n_cols":16,"rows_kept":300,"cut":false,"hidden":false,"merged":[]}
["ID","PA-SEI","Objeto","Qtd dias para a contratação","Data estimada\nETP","Data estimada\nTR/PB","Data estimada\nRenovação/ Prorrogação","Data estimada\nContratação","Data efetiva entrega \nETP","Dt efetiva entrega\nTR/PB","Dt início procedimentos de prorrogação/ renovação","Dt efetiva Contratação","stat_ETP","stat_TR/PB","stat_renov/ prorrog","stat_cont"]
[{"$f":"CAC!A6","v":"SEVIT - 15317159"},{"$f":"CAC!C6","v":0},{"$f":"CAC!B6","v":"Lavagem de veículos para os veículos oficiais da Seção Judiciária de Roraima."},{"$f":"H2-TODAY()","v":109},{"$f":"CAC!W6","v":"2022-12-02"},{"$f":"CAC!X6","v":"2022-12-27"},{"$f":"CAC!AB6","v":"---"},{"$f":"CAC!AC6","v":"2023-02-11"},null,null,null,null,{"$f":"IF(E2=\"---\",\"N/A\",IF(AND(I2=\"\",NOW()-E2<0),\"Em dia\",IF(AND(I2=\"\",NOW()-E2>0),\"Pendência\",IF(I2>E2,\"Entregue com atraso\",\"Entregue\"))))","v":"Em dia"},{"$f":"IF(F2=\"---\",\"N/A\",IF(AND(J2=\"\",NOW()-F2<0),\"Em dia\",IF(AND(J2=\"\",NOW()-F2>0),\"Pendência\",IF(J2>F2,\"Entregue com atraso\",\"Entregue\"))))","v":"Em dia"},{"$f":"IF(G2=\"---\",\"N/A\",IF(AND(K2=\"\",NOW()-G2<0),\"Em dia\",IF(AND(K2=\"\",NOW()-G2>0),\"Pendência\",IF(K2>G2,\"Contratado com atraso\",\"Contratado\"))))","v":"N/A"},{"$f":"IF(AND(L2=\"\",NOW()-H2<0),\"Em dia\",IF(AND(L2=\"\",NOW()-H2>0),\"Pendência\",IF(L2>H2,\"Contratado com atraso\",\"Contratado\")))","v":"Em dia"}]
[{"$f":"CAC!A7","v":"SEVIT - 15317179"},{"$f":"CAC!C7","v":0},{"$f":"CAC!B7","v":"Serviços de manutenção preventiva e corretiva a serem executados nos veículos oficiais pertencentes à SJRR."},{"$f":"H3-TODAY()","v":138},{"$f":"CAC!W7","v":"2022-12-31"},{"$f":"CAC!X7","v":"2023-01-25"},{"$f":"CAC!AB7","v":"---"},{"$f":"CAC!AC7","v":"2023-03-12"},null,null,null,null,{"$f":"IF(E3=\"---\",\"N/A\",IF(AND(I3=\"\",NOW()-E3<0),\"Em dia\",IF(AND(I3=\"\",NOW()-E3>0),\"Pendência\",IF(I3>E3,\"Entregue com atraso\",\"Entregue\"))))","v":"Em dia"},{"$f":"IF(F3=\"---\",\"N/A\",IF(AND(J3=\"\",NOW()-F3<0),\"Em dia\",IF(AND(J3=\"\",NOW()-F3>0),\"Pendência\",IF(J3>F3,\"Entregue com atraso\",\"Entregue\"))))","v":"Em dia"},{"$f":"IF(G3=\"---\",\"N/A\",IF(AND(K3=\"\",NOW()-G3<0),\"Em dia\",IF(AND(K3=\"\",NOW()-G3>0),\"Pendência\",IF(K3>G3,\"Contratado com atraso\",\"Contratado\"))))","v":"N/A"},{"$f":"IF(AND(L3=\"\",NOW()-H3<0),\"Em dia\",IF(AND(L3=\"\",NOW()-H3>0),\"Pendência\",IF(L3>H3,\"Contratado com atraso\",\"Contratado\")))","v":"Em dia"}]
[{"$f":"CAC!A8","v":"SEVIT - 15317201"},{"$f":"CAC!C8","v":0},{"$f":"CAC!B8","v":"Fornecimento de combustíveis (gasolina comum, óleo diesel comum, óleo diesel S10 e etanol), destinados ao abastecimento dos veículos oficiais e do grupo gerador de energia elétrica da Justiça Federal de Primeira Instância - Seção Judiciária de Roraima"},169,{"$f":"CAC!W8","v":"2022-12-03"},{"$f":"CAC!X8","v":"2022-12-28"},{"$f":"CAC!AB8","v":"---"},{"$f":"CAC!AC8","v":"2023-04-12"},null,null,null,null,"Em dia","Em dia","N/A","Em dia"]
[{"$f":"CAC!A9","v":"SEVIT - 15317489"},{"$f":"CAC!C9","v":0},{"$f":"CAC!B9","v":"Serviços de manutenção preventiva e corretiva de Porta Giratória Detector de Metais."},207,{"$f":"CAC!W9","v":"---"},{"$f":"CAC!X9","v":"---"},{"$f":"CAC!AB9","v":"2023-03-21"},{"$f":"CAC!AC9","v":"2023-05-20"},null,null,null,null,"N/A","N/A","Em dia","Em dia"]
[{"$f":"CAC!A10","v":"SEVIT - 15342869"},{"$f":"CAC!C10","v":0},{"$f":"CAC!B10","v":"Serviços de seguro automotivo para os veículos oficiais que integram a frota da SJRR."},207,{"$f":"CAC!W10","v":"2023-03-10"},{"$f":"CAC!X10","v":"2023-04-04"},{"$f":"CAC!AB10","v":"---"},{"$f":"CAC!AC10","v":"2023-05-20"},null,null,null,null,"Em dia","Em dia","N/A","Em dia"]
[{"$f":"CAC!A11","v":"SEVIT - 15343725"},{"$f":"CAC!C11","v":0},{"$f":"CAC!B11","v":"Contratar ou firmar convênio com instituições de segurança pública, para realização de Curso de Treinamento de Tiro, para os servidores, Agentes da Polícia Judicial, aptos a portar arma de fogo da Seção Judiciária de Roraima."},291,{"$f":"CAC!W11","v":"2023-06-02"},{"$f":"CAC!X11","v":"2023-06-27"},{"$f":"CAC!AB11","v":"---"},{"$f":"CAC!AC11","v":"2023-08-12"},null,null,null,null,"Em dia","Em dia","N/A","Em dia"]
[{"$f":"CAC!A12","v":"SEVIT - 15344700"},{"$f":"CAC!C12","v":0},{"$f":"CAC!B12","v":"Serviços de vigilância armada e segurança patrimonial 24h, com postos nos principais locais de acesso do edifício-sede da Seção Judiciária de Roraima."},348,{"$f":"CAC!W12","v":"---"},{"$f":"CAC!X12","v":"---"},{"$f":"CAC!AB12","v":"2023-08-09"},{"$f":"CAC!AC12","v":"2023-10-08"},null,null,null,null,"N/A","N/A","Em dia","Em dia"]
[{"$f":"CAC!A13","v":"SEVIT - 15344763"},{"$f":"CAC!C13","v":0},{"$f":"CAC!B13","v":"Serviços de treinamento (certificação) de atualização e formação de Brigada de Prevenção e Combate a Incêndio."},{"$f":"H9-TODAY()","v":323},{"$f":"CAC!W13","v":"2023-07-04"},{"$f":"CAC!X13","v":"2023-07-29"},{"$f":"CAC!AB13","v":"---"},{"$f":"CAC!AC13","v":"2023-09-13"},null,null,null,null,"Em dia","Em dia","N/A","Em dia"]
[{"$f":"CAC!A14","v":"SEVIT - 15345811"},{"$f":"CAC!C14","v":0},{"$f":"CAC!B14","v":"Serviços de recarga e de manutenção dos extintores de incêndio pertencentes à Seção Judiciária de Roraima."},323,{"$f":"CAC!W14","v":"2023-07-04"},{"$f":"CAC!X14","v":"2023-07-29"},{"$f":"CAC!AB14","v":"---"},{"$f":"CAC!AC14","v":"2023-09-13"},null,null,null,null,"Em dia","Em dia","N/A","Em dia"]
[{"$f":"CAC!A15","v":"SEVIT - 15345982"},{"$f":"CAC!C15","v":0},{"$f":"CAC!B15","v":"Serviços de manutenção preventiva e corretiva de Equipamento de Inspeção de Raio X, tipo Scanner, modelo Spectrum 5030."},354,{"$f":"CAC!W15","v":"---"},{"$f":"CAC!X15","v":"---"},{"$f":"CAC!AB15","v":"2023-08-15"},{"$f":"CAC!AC15","v":"2023-10-14"},null,null,null,null,"N/A","N/A","Em dia","Em dia"]
[{"$f":"CAC!A16","v":"SEVIT - 15846451"},{"$f":"CAC!C16","v":0},{"$f":"CAC!B16","v":"Uniformes e acessórios de identificação visual, para os Agentes da Polícia Judicial."},140,{"$f":"CAC!W16","v":"2023-01-04"},{"$f":"CAC!X16","v":"2023-01-29"},{"$f":"CAC!AB16","v":"---"},{"$f":"CAC!AC16","v":"2023-03-14"},null,null,null,null,"Em dia","Em dia","N/A","Em dia"]
[{"$f":"CAC!A17","v":"SECAM - 15328939"},{"$f":"CAC!C17","v":0},{"$f":"CAC!B17","v":"Serviços de publicação de editais, avisos e notas oficiais de interesse desta Seccional em jornal local de grande circulação Regional."},50,{"$f":"CAC!W17","v":"2022-10-06"},{"$f":"CAC!X17","v":"2022-10-31"},{"$f":"CAC!AB17","v":"---"},{"$f":"CAC!AC17","v":"2022-12-14"},null,null,null,null,"Pendência","Em dia","N/A","Em dia"]
[{"$f":"CAC!A18","v":"SECAM - 15732555"},{"$f":"CAC!C18","v":0},{"$f":"CAC!B18","v":"Serviços de locação de 04 (quatro) fotocopiadoras, com fornecimento de suprimentos."},226,{"$f":"CAC!W18","v":"---"},{"$f":"CAC!X18","v":"---"},{"$f":"CAC!AB18","v":"2023-04-09"},{"$f":"CAC!AC18","v":"2023-06-08"},null,null,null,null,"N/A","N/A","Em dia","Em dia"]
[{"$f":"CAC!A19","v":"SECAM - 15732641"},{"$f":"CAC!C19","v":0},{"$f":"CAC!B19","v":"Serviços de Telefonia Móvel Pessoal - SMP."},252,{"$f":"CAC!W19","v":"2023-03-13"},{"$f":"CAC!X19","v":"2023-04-07"},{"$f":"CAC!AB19","v":"---"},{"$f":"CAC!AC19","v":"2023-07-04"},null,null,null,null,"Em dia","Em dia","N/A","Em dia"]
[{"$f":"CAC!A20","v":"SECAM - 15331353"},{"$f":"CAC!C20","v":0},{"$f":"CAC!B20","v":"Serviços de postagens e encomendas da Seção Judiciária de Roraima."},-226,{"$f":"CAC!W20","v":"---"},{"$f":"CAC!X20","v":"---"},{"$f":"CAC!AB20","v":"2022-01-12"},{"$f":"CAC!AC20","v":"2022-03-13"},null,null,null,null,"N/A","N/A","Pendência","Pendência"]
[{"$f":"CAC!A21","v":"SECAM - 15732819"},{"$f":"CAC!C21","v":0},{"$f":"CAC!B21","v":" Serviço de Telefonia Fixa Comutada."},289,{"$f":"CAC!W21","v":"2023-04-19"},{"$f":"CAC!X21","v":"2023-05-14"},{"$f":"CAC!AB21","v":"---"},{"$f":"CAC!AC21","v":"2023-08-10"},null,null,null,null,"Em dia","Em dia","N/A","Em dia"]
[{"$f":"CAC!A22","v":"SEINF - 15328883"},{"$f":"CAC!C22","v":0},{"$f":"CAC!B22","v":"Serviços técnicos especializados para apoio na área de TI para atividades de apoio."},80,{"$f":"CAC!W22","v":"2022-10-17"},{"$f":"CAC!X22","v":"2022-11-11"},{"$f":"CAC!AB22","v":"---"},{"$f":"CAC!AC22","v":"2023-01-13"},null,null,null,null,"Pendência","Em dia","N/A","Em dia"]
[{"$f":"CAC!A23","v":"SELIT - 15330055"},{"$f":"CAC!C23","v":0},{"$f":"CAC!B23","v":"Fornecimento de Passagem Aérea"},141,{"$f":"CAC!W23","v":"2022-11-05"},{"$f":"CAC!X23","v":"2022-11-30"},{"$f":"CAC!AB23","v":"---"},{"$f":"CAC!AC23","v":"2023-03-15"},null,null,null,null,"Em dia","Em dia","N/A","Em dia"]
[{"$f":"CAC!A24","v":"SELIT - 15330056"},{"$f":"CAC!C24","v":0},{"$f":"CAC!B24","v":"Aquisição de assinatura online para a plataforma de pesquisa preços"},200,{"$f":"CAC!W24","v":"2023-03-05"},{"$f":"CAC!X24","v":"2023-03-30"},{"$f":"CAC!AB24","v":"---"},{"$f":"CAC!AC24","v":"2023-05-13"},null,null,null,null,"Em dia","Em dia","N/A","Em dia"]
[{"$f":"CAC!A25","v":"SEBES - 15770124"},{"$f":"CAC!C25","v":0},{"$f":"CAC!B25","v":"Assistência médica, psicológica e odontológica direta aos magistrados e servidores ativos, inativos, e aos seus dependentes"},77,{"$f":"CAC!W25","v":"2022-09-02"},{"$f":"CAC!X25","v":"2022-09-27"},{"$f":"CAC!AB25","v":"---"},{"$f":"CAC!AC25","v":"2023-01-10"},null,null,null,null,"Pendência","Pendência","N/A","Em dia"]
[{"$f":"CAC!A26","v":"SEBES - 15770520"},{"$f":"CAC!C26","v":0},{"$f":"CAC!B26","v":"Manutenção preventiva e corretiva dos equipamentos do consultório odontológico da SJRR"},259,{"$f":"CAC!W26","v":"---"},{"$f":"CAC!X26","v":"---"},{"$f":"CAC!AB26","v":"2023-05-12"},{"$f":"CAC!AC26","v":"2023-07-11"},null,null,null,null,"N/A","N/A","Em dia","Em dia"]
[{"$f":"CAC!A27","v":"SEBES - 15330874"},{"$f":"CAC!C27","v":0},{"$f":"CAC!B27","v":"Aquisição de Vacinas para imunização contra a gripe H1N1"},169,{"$f":"CAC!W27","v":"2023-01-31"},{"$f":"CAC!X27","v":"2023-02-25"},{"$f":"CAC!AB27","v":"---"},{"$f":"CAC!AC27","v":"2023-04-12"},null,null,null,null,"Em dia","Em dia","N/A","Em dia"]
[{"$f":"CAC!A28","v":"SEBES - 15330879"},{"$f":"CAC!C28","v":0},{"$f":"CAC!B28","v":"Materiais e medicamentos para os consultórios médico e odontológico da Seção Judiciária de Roraima"},261,{"$f":"CAC!W28","v":"2023-01-14"},{"$f":"CAC!X28","v":"2023-02-08"},{"$f":"CAC!AB28","v":"---"},{"$f":"CAC!AC28","v":"2023-07-13"},null,null,null,null,"Em dia","Em dia","N/A","Em dia"]
[{"$f":"CAC!A29","v":"SEMAP - 15331081"},{"$f":"CAC!C29","v":0},{"$f":"CAC!B29","v":"Aquisição de materiais de consumo diversos para consecução das atividades internas na SJRR."},139,{"$f":"CAC!W29","v":"2022-09-14"},{"$f":"CAC!X29","v":"2022-10-09"},{"$f":"CAC!AB29","v":"---"},{"$f":"CAC!AC29","v":"2023-03-13"},null,null,null,null,"Pendência","Pendência","N/A","Em dia"]
[{"$f":"CAC!A30","v":"SESEG - 15770821"},{"$f":"CAC!C30","v":0},{"$f":"CAC!B30","v":"Serviços de limpeza, conservação, copeiragem e jardinagem, com fornecimento de material de limpeza e jardinagem."},80,{"$f":"CAC!W30","v":"---"},{"$f":"CAC!X30","v":"---"},{"$f":"CAC!AB30","v":"2022-11-14"},{"$f":"CAC!AC30","v":"2023-01-13"},null,null,null,null,"N/A","N/A","Em dia","Em dia"]
[{"$f":"CAC!A31","v":"SESEG - 15770921"},{"$f":"CAC!C31","v":0},{"$f":"CAC!B31","v":"Prestação de serviços continuados de apoio administrativo nas dependências da Seção Judiciária de Roraima"},58,{"$f":"CAC!W31","v":"2022-09-25"},{"$f":"CAC!X31","v":"2022-10-20"},{"$f":"CAC!AB31","v":"---"},{"$f":"CAC!AC31","v":"2022-12-22"},null,null,null,null,"Pendência","Pendência","N/A","Em dia"]
[{"$f":"CAC!A32","v":"SESEG - 15771480 "},{"$f":"CAC!C32","v":0},{"$f":"CAC!B32","v":"Prestação de serviços continuados de manutenção predial nas dependências da Seção Judiciária de Roraima"},114,{"$f":"CAC!W32","v":"---"},{"$f":"CAC!X32","v":"---"},{"$f":"CAC!AB32","v":"2022-12-18"},{"$f":"CAC!AC32","v":"2023-02-16"},null,null,null,null,"N/A","N/A","Em dia","Em dia"]
[{"$f":"CAC!A33","v":"SESEG - 15771771"},{"$f":"CAC!C33","v":0},{"$f":"CAC!B33","v":"Prestação de serviços continuados de manutenção no elevador localizado nas dependências da Seção Judiciária de Roraima"},195,{"$f":"CAC!W33","v":"---"},{"$f":"CAC!X33","v":"---"},{"$f":"CAC!AB33","v":"2023-03-09"},{"$f":"CAC!AC33","v":"2023-05-08"},null,null,null,null,"N/A","N/A","Em dia","Em dia"]
[{"$f":"CAC!A34","v":"SESEG - 15771816"},{"$f":"CAC!C34","v":0},{"$f":"CAC!B34","v":"Prestação de serviços continuados de manutenção em 6(seis) no-breaks prediais localizados nas dependências da Seção Judiciária de Roraima"},292,{"$f":"CAC!W34","v":"---"},{"$f":"CAC!X34","v":"---"},{"$f":"CAC!AB34","v":"2023-06-14"},{"$f":"CAC!AC34","v":"2023-08-13"},null,null,null,null,"N/A","N/A","Em dia","Em dia"]
[{"$f":"CAC!A35","v":"SESEG - 15771899"},{"$f":"CAC!C35","v":0},{"$f":"CAC!B35","v":"Prestação de serviços continuados de fornecimento de energia elétrica para a Seção Judiciária de Roraima"},230,{"$f":"CAC!W35","v":"2023-04-02"},{"$f":"CAC!X35","v":"2023-04-27"},{"$f":"CAC!AB35","v":"---"},{"$f":"CAC!AC35","v":"2023-06-12"},null,null,null,null,"Em dia","Em dia","N/A","Em dia"]
[{"$f":"CAC!A36","v":"SESEG - 15771980"},{"$f":"CAC!C36","v":0},{"$f":"CAC!B36","v":"Prestação de serviços continuados de abastecimento  de água encanada para a Seção Judiciária de Roraima"},80,{"$f":"CAC!W36","v":"2022-11-05"},{"$f":"CAC!X36","v":"2022-11-30"},{"$f":"CAC!AB36","v":"---"},{"$f":"CAC!AC36","v":"2023-01-13"},null,null,null,null,"Em dia","Em dia","N/A","Em dia"]
[{"$f":"CAC!A37","v":"SESEG - 15772019"},{"$f":"CAC!C37","v":0},{"$f":"CAC!B37","v":"Prestação de serviço de manutenção no grupo gerador, subestação e USCA localizados nas dependências da Seção Judiciária de Roraima"},391,{"$f":"CAC!W37","v":"---"},{"$f":"CAC!X37","v":"---"},{"$f":"CAC!AB37","v":"2023-09-21"},{"$f":"CAC!AC37","v":"2023-11-20"},null,null,null,null,"N/A","N/A","Em dia","Em dia"]
[{"$f":"CAC!A38","v":"SESEG - 15772067"},{"$f":"CAC!C38","v":0},{"$f":"CAC!B38","v":"Prestação de serviços continuados  de manutenção preventiva/corretiva nos equipamentos que compõem os sistemas de abastecimento d'água e de combate a incêndio localizados nas dependências da Seção Judiciária de Roraima"},356,{"$f":"CAC!W38","v":"---"},{"$f":"CAC!X38","v":"---"},{"$f":"CAC!AB38","v":"2023-08-17"},{"$f":"CAC!AC38","v":"2023-10-16"},null,null,null,null,"N/A","N/A","Em dia","Em dia"]
[{"$f":"CAC!A39","v":"SESEG - 15711791"},{"$f":"CAC!C39","v":0},{"$f":"CAC!B39","v":"Manter o volume de dejetos contidos nas fossas sépticas em níveis aceitáveis, reduzindo-se a possibilidade de transbordamentos; Manter a rede de esgoto desobstruída, evitando-se, assim, transbordamentos e mau cheiro"},80,{"$f":"CAC!W39","v":"2022-11-05"},{"$f":"CAC!X39","v":"2022-11-30"},{"$f":"CAC!AB39","v":"---"},{"$f":"CAC!AC39","v":"2023-01-13"},null,null,null,null,"Em dia","Em dia","N/A","Em dia"]
[{"$f":"CAC!A40","v":"SESEG - 15711835"},{"$f":"CAC!C40","v":0},{"$f":"CAC!B40","v":"Carga de gás de cozinha (GLP) em botija de 13 quilos"},80,{"$f":"CAC!W40","v":"2022-11-05"},{"$f":"CAC!X40","v":"2022-11-30"},{"$f":"CAC!AB40","v":"---"},{"$f":"CAC!AC40","v":"2023-01-13"},null,null,null,null,"Em dia","Em dia","N/A","Em dia"]
[{"$f":"CAC!A41","v":"SESEG - 15711889"},{"$f":"CAC!C41","v":0},{"$f":"CAC!B41","v":"Fornecimento de gêneros alimentícios (café, açucar,adoçante, água mineral)"},139,{"$f":"CAC!W41","v":"2022-10-09"},{"$f":"CAC!X41","v":"2022-11-03"},{"$f":"CAC!AB41","v":"---"},{"$f":"CAC!AC41","v":"2023-03-13"},null,null,null,null,"Pendência","Em dia","N/A","Em dia"]
[{"$f":"CAC!A42","v":"SESEG - 15712033"},{"$f":"CAC!C42","v":0},{"$f":"CAC!B42","v":"contratação dos serviços de manutenções preventivas periódicas e corretivas nos aparelhos condicionadores de ar"},139,{"$f":"CAC!W42","v":"2022-09-14"},{"$f":"CAC!X42","v":"2022-10-09"},{"$f":"CAC!AB42","v":"---"},{"$f":"CAC!AC42","v":"2023-03-13"},null,null,null,null,"Pendência","Pendência","N/A","Em dia"]
[{"$f":"CAC!A43","v":"SESEG - 15712415"},{"$f":"CAC!C43","v":0},{"$f":"CAC!B43","v":"Aquisição de peças para aparelhos condicionadores de ar,"},108,{"$f":"CAC!W43","v":"2022-08-14"},{"$f":"CAC!X43","v":"2022-09-08"},{"$f":"CAC!AB43","v":"---"},{"$f":"CAC!AC43","v":"2023-02-10"},null,null,null,null,"Pendência","Pendência","N/A","Em dia"]
[{"$f":"CAC!A44","v":"SESEG - 15713211"},{"$f":"CAC!C44","v":0},{"$f":"CAC!B44","v":"Aquisição de  Bateria selada regulada por válvula, estacionária 45Ah, 12V."},230,{"$f":"CAC!W44","v":"2023-03-16"},{"$f":"CAC!X44","v":"2023-04-10"},{"$f":"CAC!AB44","v":"---"},{"$f":"CAC!AC44","v":"2023-06-12"},null,null,null,null,"Em dia","Em dia","N/A","Em dia"]
[{"$f":"CAC!A45","v":"SESEG - 15713330"},{"$f":"CAC!C45","v":0},{"$f":"CAC!B45","v":"Aquisição de materiais elétrico/hidráulico"},322,{"$f":"CAC!W45","v":"2023-03-16"},{"$f":"CAC!X45","v":"2023-04-10"},{"$f":"CAC!AB45","v":"---"},{"$f":"CAC!AC45","v":"2023-09-12"},null,null,null,null,"Em dia","Em dia","N/A","Em dia"]
[{"$f":"CAC!A46","v":"SESEG - 15713366"},{"$f":"CAC!C46","v":0},{"$f":"CAC!B46","v":"Aquisição de materiais de copa e cozinha"},322,{"$f":"CAC!W46","v":"2023-04-10"},{"$f":"CAC!X46","v":"2023-05-05"},{"$f":"CAC!AB46","v":"---"},{"$f":"CAC!AC46","v":"2023-09-12"},null,null,null,null,"Em dia","Em dia","N/A","Em dia"]
[{"$f":"CAC!A47","v":"SESEG - 15713404"},{"$f":"CAC!C47","v":0},{"$f":"CAC!B47","v":"Prestação de serviços de áudio e vídeo que objetive o registro de Sessão de julgamento do Tribunal de Júri Federal da Justiça Federal de 1ª Instância – Seção Judiciária de Roraima."},230,{"$f":"CAC!W47","v":"2023-04-02"},{"$f":"CAC!X47","v":"2023-04-27"},{"$f":"CAC!AB47","v":"---"},{"$f":"CAC!AC47","v":"2023-06-12"},null,null,null,null,"Em dia","Em dia","N/A","Em dia"]
[{"$f":"CAC!A48","v":"SESEG - 15713439"},{"$f":"CAC!C75","v":0},{"$f":"CAC!B75","v":0},-44859,{"$f":"CAC!W75","v":"00:00:00"},{"$f":"CAC!X75","v":"00:00:00"},{"$f":"CAC!AB75","v":"00:00:00"},{"$f":"CAC!AC75","v":"00:00:00"},null,null,null,null,"Pendência","Pendência","Pendência","Pendência"]
[{"$f":"CAC!A49","v":"SESEG - 15713478"},{"$f":"CAC!C76","v":0},{"$f":"CAC!B76","v":0},-44859,{"$f":"CAC!W76","v":"00:00:00"},{"$f":"CAC!X76","v":"00:00:00"},{"$f":"CAC!AB76","v":"00:00:00"},{"$f":"CAC!AC76","v":"00:00:00"},null,null,null,null,"Pendência","Pendência","Pendência","Pendência"]
[{"$f":"CAC!A50","v":"SEDER - 16594403"},{"$f":"CAC!C77","v":0},{"$f":"CAC!B77","v":0},-44859,{"$f":"CAC!W77","v":"00:00:00"},{"$f":"CAC!X77","v":"00:00:00"},{"$f":"CAC!AB77","v":"00:00:00"},{"$f":"CAC!AC77","v":"00:00:00"},null,null,null,null,"Pendência","Pendência","Pendência","Pendência"]
[{"$f":"CAC!A51","v":0},{"$f":"CAC!C78","v":0},{"$f":"CAC!B78","v":0},-44859,{"$f":"CAC!W78","v":"00:00:00"},{"$f":"CAC!X78","v":"00:00:00"},{"$f":"CAC!AB78","v":"00:00:00"},{"$f":"CAC!AC78","v":"00:00:00"},null,null,null,null,"Pendência","Pendência","Pendência","Pendência"]
[{"$f":"CAC!A52","v":0},{"$f":"CAC!C79","v":0},{"$f":"CAC!B79","v":0},-44859,{"$f":"CAC!W79","v":"00:00:00"},{"$f":"CAC!X79","v":"00:00:00"},{"$f":"CAC!AB79","v":"00:00:00"},{"$f":"CAC!AC79","v":"00:00:00"},null,null,null,null,"Pendência","Pendência","Pendência","Pendência"]
[{"$f":"CAC!A53","v":0},{"$f":"CAC!C80","v":0},{"$f":"CAC!B80","v":0},-44859,{"$f":"CAC!W80","v":"00:00:00"},{"$f":"CAC!X80","v":"00:00:00"},{"$f":"CAC!AB80","v":"00:00:00"},{"$f":"CAC!AC80","v":"00:00:00"},null,null,null,null,"Pendência","Pendência","Pendência","Pendência"]
[{"$f":"CAC!A54","v":0},{"$f":"CAC!C81","v":0},{"$f":"CAC!B81","v":0},-44859,{"$f":"CAC!W81","v":"00:00:00"},{"$f":"CAC!X81","v":"00:00:00"},{"$f":"CAC!AB81","v":"00:00:00"},{"$f":"CAC!AC81","v":"00:00:00"},null,null,null,null,"Pendência","Pendência","Pendência","Pendência"]
[{"$f":"CAC!A55","v":0},{"$f":"CAC!C82","v":0},{"$f":"CAC!B82","v":0},-44859,{"$f":"CAC!W82","v":"00:00:00"},{"$f":"CAC!X82","v":"00:00:00"},{"$f":"CAC!AB82","v":"00:00:00"},{"$f":"CAC!AC82","v":"00:00:00"},null,null,null,null,"Pendência","Pendência","Pendência","Pendência"]
[{"$f":"CAC!A56","v":0},{"$f":"CAC!C83","v":0},{"$f":"CAC!B83","v":0},-44859,{"$f":"CAC!W83","v":"00:00:00"},{"$f":"CAC!X83","v":"00:00:00"},{"$f":"CAC!AB83","v":"00:00:00"},{"$f":"CAC!AC83","v":"00:00:00"},null,null,null,null,"Pendência","Pendência","Pendência","Pendência"]
[{"$f":"CAC!A57","v":0},{"$f":"CAC!C84","v":0},{"$f":"CAC!B84","v":0},-44859,{"$f":"CAC!W84","v":"00:00:00"},{"$f":"CAC!X84","v":"00:00:00"},{"$f":"CAC!AB84","v":"00:00:00"},{"$f":"CAC!AC84","v":"00:00:00"},null,null,null,null,"Pendência","Pendência","Pendência","Pendência"]
[{"$f":"CAC!A58","v":0},{"$f":"CAC!C85","v":0},{"$f":"CAC!B85","v":0},-44859,{"$f":"CAC!W85","v":"00:00:00"},{"$f":"CAC!X85","v":"00:00:00"},{"$f":"CAC!AB85","v":"00:00:00"},{"$f":"CAC!AC85","v":"00:00:00"},null,null,null,null,"Pendência","Pendência","Pendência","Pendência"]
[{"$f":"CAC!A59","v":0},{"$f":"CAC!C86","v":0},{"$f":"CAC!B86","v":0},-44859,{"$f":"CAC!W86","v":"00:00:00"},{"$f":"CAC!X86","v":"00:00:00"},{"$f":"CAC!AB86","v":"00:00:00"},{"$f":"CAC!AC86","v":"00:00:00"},null,null,null,null,"Pendência","Pendência","Pendência","Pendência"]
[{"$f":"CAC!A60","v":0},{"$f":"CAC!C87","v":0},{"$f":"CAC!B87","v":0},-44859,{"$f":"CAC!W87","v":"00:00:00"},{"$f":"CAC!X87","v":"00:00:00"},{"$f":"CAC!AB87","v":"00:00:00"},{"$f":"CAC!AC87","v":"00:00:00"},null,null,null,null,"Pendência","Pendência","Pendência","Pendência"]
[{"$f":"CAC!A61","v":0},{"$f":"CAC!C88","v":0},{"$f":"CAC!B88","v":0},-44859,{"$f":"CAC!W88","v":"00:00:00"},{"$f":"CAC!X88","v":"00:00:00"},{"$f":"CAC!AB88","v":"00:00:00"},{"$f":"CAC!AC88","v":"00:00:00"},null,null,null,null,"Pendência","Pendência","Pendência","Pendência"]
[{"$f":"CAC!A62","v":0},{"$f":"CAC!C89","v":0},{"$f":"CAC!B89","v":0},-44859,{"$f":"CAC!W89","v":"00:00:00"},{"$f":"CAC!X89","v":"00:00:00"},{"$f":"CAC!AB89","v":"00:00:00"},{"$f":"CAC!AC89","v":"00:00:00"},null,null,null,null,"Pendência","Pendência","Pendência","Pendência"]
[{"$f":"CAC!A63","v":0},{"$f":"CAC!C90","v":0},{"$f":"CAC!B90","v":0},-44859,{"$f":"CAC!W90","v":"00:00:00"},{"$f":"CAC!X90","v":"00:00:00"},{"$f":"CAC!AB90","v":"00:00:00"},{"$f":"CAC!AC90","v":"00:00:00"},null,null,null,null,"Pendência","Pendência","Pendência","Pendência"]
[{"$f":"CAC!A64","v":0},{"$f":"CAC!C91","v":0},{"$f":"CAC!B91","v":0},-44859,{"$f":"CAC!W91","v":"00:00:00"},{"$f":"CAC!X91","v":"00:00:00"},{"$f":"CAC!AB91","v":"00:00:00"},{"$f":"CAC!AC91","v":"00:00:00"},null,null,null,null,"Pendência","Pendência","Pendência","Pendência"]
[{"$f":"CAC!A65","v":0},{"$f":"CAC!C92","v":0},{"$f":"CAC!B92","v":0},-44859,{"$f":"CAC!W92","v":"00:00:00"},{"$f":"CAC!X92","v":"00:00:00"},{"$f":"CAC!AB92","v":"00:00:00"},{"$f":"CAC!AC92","v":"00:00:00"},null,null,null,null,"Pendência","Pendência","Pendência","Pendência"]
[{"$f":"CAC!A66","v":0},{"$f":"CAC!C93","v":0},{"$f":"CAC!B93","v":0},-44859,{"$f":"CAC!W93","v":"00:00:00"},{"$f":"CAC!X93","v":"00:00:00"},{"$f":"CAC!AB93","v":"00:00:00"},{"$f":"CAC!AC93","v":"00:00:00"},null,null,null,null,"Pendência","Pendência","Pendência","Pendência"]
[{"$f":"CAC!A67","v":0},{"$f":"CAC!C94","v":0},{"$f":"CAC!B94","v":0},-44859,{"$f":"CAC!W94","v":"00:00:00"},{"$f":"CAC!X94","v":"00:00:00"},{"$f":"CAC!AB94","v":"00:00:00"},{"$f":"CAC!AC94","v":"00:00:00"},null,null,null,null,"Pendência","Pendência","Pendência","Pendência"]
[{"$f":"CAC!A68","v":0},{"$f":"CAC!C95","v":0},{"$f":"CAC!B95","v":0},-44859,{"$f":"CAC!W95","v":"00:00:00"},{"$f":"CAC!X95","v":"00:00:00"},{"$f":"CAC!AB95","v":"00:00:00"},{"$f":"CAC!AC95","v":"00:00:00"},null,null,null,null,"Pendência","Pendência","Pendência","Pendência"]
[{"$f":"CAC!A69","v":0},{"$f":"CAC!C96","v":0},{"$f":"CAC!B96","v":0},-44859,{"$f":"CAC!W96","v":"00:00:00"},{"$f":"CAC!X96","v":"00:00:00"},{"$f":"CAC!AB96","v":"00:00:00"},{"$f":"CAC!AC96","v":"00:00:00"},null,null,null,null,"Pendência","Pendência","Pendência","Pendência"]
[{"$f":"CAC!A70","v":0},{"$f":"CAC!C97","v":0},{"$f":"CAC!B97","v":0},-44859,{"$f":"CAC!W97","v":"00:00:00"},{"$f":"CAC!X97","v":"00:00:00"},{"$f":"CAC!AB97","v":"00:00:00"},{"$f":"CAC!AC97","v":"00:00:00"},null,null,null,null,"Pendência","Pendência","Pendência","Pendência"]
[{"$f":"CAC!A71","v":0},{"$f":"CAC!C98","v":0},{"$f":"CAC!B98","v":0},{"$f":"H67-TODAY()","v":-44859},{"$f":"CAC!W98","v":"00:00:00"},{"$f":"CAC!X98","v":"00:00:00"},{"$f":"CAC!AB98","v":"00:00:00"},{"$f":"CAC!AC98","v":"00:00:00"},null,null,null,null,{"$f":"IF(E67=\"---\",\"N/A\",IF(AND(I67=\"\",NOW()-E67<0),\"Em dia\",IF(AND(I67=\"\",NOW()-E67>0),\"Pendência\",IF(I67>E67,\"Entregue com atraso\",\"Entregue\"))))","v":"Pendência"},{"$f":"IF(F67=\"---\",\"N/A\",IF(AND(J67=\"\",NOW()-F67<0),\"Em dia\",IF(AND(J67=\"\",NOW()-F67>0),\"Pendência\",IF(J67>F67,\"Entregue com atraso\",\"Entregue\"))))","v":"Pendência"},{"$f":"IF(G67=\"---\",\"N/A\",IF(AND(K67=\"\",NOW()-G67<0),\"Em dia\",IF(AND(K67=\"\",NOW()-G67>0),\"Pendência\",IF(K67>G67,\"Contratado com atraso\",\"Contratado\"))))","v":"Pendência"},{"$f":"IF(AND(L67=\"\",NOW()-H67<0),\"Em dia\",IF(AND(L67=\"\",NOW()-H67>0),\"Pendência\",IF(L67>H67,\"Contratado com atraso\",\"Contratado\")))","v":"Pendência"}]
[{"$f":"CAC!A72","v":0},{"$f":"CAC!C99","v":0},{"$f":"CAC!B99","v":0},-44859,{"$f":"CAC!W99","v":"00:00:00"},{"$f":"CAC!X99","v":"00:00:00"},{"$f":"CAC!AB99","v":"00:00:00"},{"$f":"CAC!AC99","v":"00:00:00"},null,null,null,null,"Pendência","Pendência","Pendência","Pendência"]
[{"$f":"CAC!A73","v":0},{"$f":"CAC!C100","v":0},{"$f":"CAC!B100","v":0},-44859,{"$f":"CAC!W100","v":"00:00:00"},{"$f":"CAC!X100","v":"00:00:00"},{"$f":"CAC!AB100","v":"00:00:00"},{"$f":"CAC!AC100","v":"00:00:00"},null,null,null,null,"Pendência","Pendência","Pendência","Pendência"]
[{"$f":"CAC!A74","v":0},{"$f":"CAC!C101","v":0},{"$f":"CAC!B101","v":0},-44859,{"$f":"CAC!W101","v":"00:00:00"},{"$f":"CAC!X101","v":"00:00:00"},{"$f":"CAC!AB101","v":"00:00:00"},{"$f":"CAC!AC101","v":"00:00:00"},null,null,null,null,"Pendência","Pendência","Pendência","Pendência"]
[{"$f":"CAC!A75","v":0},{"$f":"CAC!C102","v":0},{"$f":"CAC!B102","v":0},-44859,{"$f":"CAC!W102","v":"00:00:00"},{"$f":"CAC!X102","v":"00:00:00"},{"$f":"CAC!AB102","v":"00:00:00"},{"$f":"CAC!AC102","v":"00:00:00"},null,null,null,null,"Pendência","Pendência","Pendência","Pendência"]
[{"$f":"CAC!A76","v":0},{"$f":"CAC!C103","v":0},{"$f":"CAC!B103","v":0},-44859,{"$f":"CAC!W103","v":"00:00:00"},{"$f":"CAC!X103","v":"00:00:00"},{"$f":"CAC!AB103","v":"00:00:00"},{"$f":"CAC!AC103","v":"00:00:00"},null,null,null,null,"Pendência","Pendência","Pendência","Pendência"]
[{"$f":"CAC!A77","v":0},{"$f":"CAC!C104","v":0},{"$f":"CAC!B104","v":0},-44859,{"$f":"CAC!W104","v":"00:00:00"},{"$f":"CAC!X104","v":"00:00:00"},{"$f":"CAC!AB104","v":"00:00:00"},{"$f":"CAC!AC104","v":"00:00:00"},null,null,null,null,"Pendência","Pendência","Pendência","Pendência"]
[{"$f":"CAC!A78","v":0},{"$f":"CAC!C105","v":0},{"$f":"CAC!B105","v":0},-44859,{"$f":"CAC!W105","v":"00:00:00"},{"$f":"CAC!X105","v":"00:00:00"},{"$f":"CAC!AB105","v":"00:00:00"},{"$f":"CAC!AC105","v":"00:00:00"},null,null,null,null,"Pendência","Pendência","Pendência","Pendência"]
[{"$f":"CAC!A79","v":0},{"$f":"CAC!C106","v":0},{"$f":"CAC!B106","v":0},-44859,{"$f":"CAC!W106","v":"00:00:00"},{"$f":"CAC!X106","v":"00:00:00"},{"$f":"CAC!AB106","v":"00:00:00"},{"$f":"CAC!AC106","v":"00:00:00"},null,null,null,null,"Pendência","Pendência","Pendência","Pendência"]
[{"$f":"CAC!A80","v":0},{"$f":"CAC!C107","v":0},{"$f":"CAC!B107","v":0},-44859,{"$f":"CAC!W107","v":"00:00:00"},{"$f":"CAC!X107","v":"00:00:00"},{"$f":"CAC!AB107","v":"00:00:00"},{"$f":"CAC!AC107","v":"00:00:00"},null,null,null,null,"Pendência","Pendência","Pendência","Pendência"]
[{"$f":"CAC!A81","v":0},{"$f":"CAC!C108","v":0},{"$f":"CAC!B108","v":0},-44859,{"$f":"CAC!W108","v":"00:00:00"},{"$f":"CAC!X108","v":"00:00:00"},{"$f":"CAC!AB108","v":"00:00:00"},{"$f":"CAC!AC108","v":"00:00:00"},null,null,null,null,"Pendência","Pendência","Pendência","Pendência"]
[{"$f":"CAC!A82","v":0},{"$f":"CAC!C109","v":0},{"$f":"CAC!B109","v":0},-44859,{"$f":"CAC!W109","v":"00:00:00"},{"$f":"CAC!X109","v":"00:00:00"},{"$f":"CAC!AB109","v":"00:00:00"},{"$f":"CAC!AC109","v":"00:00:00"},null,null,null,null,"Pendência","Pendência","Pendência","Pendência"]
[{"$f":"CAC!A83","v":0},{"$f":"CAC!C110","v":0},{"$f":"CAC!B110","v":0},-44859,{"$f":"CAC!W110","v":"00:00:00"},{"$f":"CAC!X110","v":"00:00:00"},{"$f":"CAC!AB110","v":"00:00:00"},{"$f":"CAC!AC110","v":"00:00:00"},null,null,null,null,"Pendência","Pendência","Pendência","Pendência"]
[{"$f":"CAC!A84","v":0},{"$f":"CAC!C111","v":0},{"$f":"CAC!B111","v":0},-44859,{"$f":"CAC!W111","v":"00:00:00"},{"$f":"CAC!X111","v":"00:00:00"},{"$f":"CAC!AB111","v":"00:00:00"},{"$f":"CAC!AC111","v":"00:00:00"},null,null,null,null,"Pendência","Pendência","Pendência","Pendência"]
[{"$f":"CAC!A85","v":0},{"$f":"CAC!C112","v":0},{"$f":"CAC!B112","v":0},-44859,{"$f":"CAC!W112","v":"00:00:00"},{"$f":"CAC!X112","v":"00:00:00"},{"$f":"CAC!AB112","v":"00:00:00"},{"$f":"CAC!AC112","v":"00:00:00"},null,null,null,null,"Pendência","Pendência","Pendência","Pendência"]
[{"$f":"CAC!A86","v":0},{"$f":"CAC!C113","v":0},{"$f":"CAC!B113","v":0},-44859,{"$f":"CAC!W113","v":"00:00:00"},{"$f":"CAC!X113","v":"00:00:00"},{"$f":"CAC!AB113","v":"00:00:00"},{"$f":"CAC!AC113","v":"00:00:00"},null,null,null,null,"Pendência","Pendência","Pendência","Pendência"]
[{"$f":"CAC!A87","v":0},{"$f":"CAC!C114","v":0},{"$f":"CAC!B114","v":0},-44859,{"$f":"CAC!W114","v":"00:00:00"},{"$f":"CAC!X114","v":"00:00:00"},{"$f":"CAC!AB114","v":"00:00:00"},{"$f":"CAC!AC114","v":"00:00:00"},null,null,null,null,"Pendência","Pendência","Pendência","Pendência"]
[{"$f":"CAC!A88","v":0},{"$f":"CAC!C115","v":0},{"$f":"CAC!B115","v":0},-44859,{"$f":"CAC!W115","v":"00:00:00"},{"$f":"CAC!X115","v":"00:00:00"},{"$f":"CAC!AB115","v":"00:00:00"},{"$f":"CAC!AC115","v":"00:00:00"},null,null,null,null,"Pendência","Pendência","Pendência","Pendência"]
[{"$f":"CAC!A89","v":0},{"$f":"CAC!C116","v":0},{"$f":"CAC!B116","v":0},-44859,{"$f":"CAC!W116","v":"00:00:00"},{"$f":"CAC!X116","v":"00:00:00"},{"$f":"CAC!AB116","v":"00:00:00"},{"$f":"CAC!AC116","v":"00:00:00"},null,null,null,null,"Pendência","Pendência","Pendência","Pendência"]
[{"$f":"CAC!A90","v":0},{"$f":"CAC!C117","v":0},{"$f":"CAC!B117","v":0},-44859,{"$f":"CAC!W117","v":"00:00:00"},{"$f":"CAC!X117","v":"00:00:00"},{"$f":"CAC!AB117","v":"00:00:00"},{"$f":"CAC!AC117","v":"00:00:00"},null,null,null,null,"Pendência","Pendência","Pendência","Pendência"]
[{"$f":"CAC!A91","v":0},{"$f":"CAC!C118","v":0},{"$f":"CAC!B118","v":0},-44859,{"$f":"CAC!W118","v":"00:00:00"},{"$f":"CAC!X118","v":"00:00:00"},{"$f":"CAC!AB118","v":"00:00:00"},{"$f":"CAC!AC118","v":"00:00:00"},null,null,null,null,"Pendência","Pendência","Pendência","Pendência"]
[{"$f":"CAC!A92","v":0},{"$f":"CAC!C119","v":0},{"$f":"CAC!B119","v":0},-44859,{"$f":"CAC!W119","v":"00:00:00"},{"$f":"CAC!X119","v":"00:00:00"},{"$f":"CAC!AB119","v":"00:00:00"},{"$f":"CAC!AC119","v":"00:00:00"},null,null,null,null,"Pendência","Pendência","Pendência","Pendência"]
[{"$f":"CAC!A93","v":0},{"$f":"CAC!C120","v":0},{"$f":"CAC!B120","v":0},-44859,{"$f":"CAC!W120","v":"00:00:00"},{"$f":"CAC!X120","v":"00:00:00"},{"$f":"CAC!AB120","v":"00:00:00"},{"$f":"CAC!AC120","v":"00:00:00"},null,null,null,null,"Pendência","Pendência","Pendência","Pendência"]
[{"$f":"CAC!A94","v":0},{"$f":"CAC!C121","v":0},{"$f":"CAC!B121","v":0},-44859,{"$f":"CAC!W121","v":"00:00:00"},{"$f":"CAC!X121","v":"00:00:00"},{"$f":"CAC!AB121","v":"00:00:00"},{"$f":"CAC!AC121","v":"00:00:00"},null,null,null,null,"Pendência","Pendência","Pendência","Pendência"]
[{"$f":"CAC!A95","v":0},{"$f":"CAC!C122","v":0},{"$f":"CAC!B122","v":0},-44859,{"$f":"CAC!W122","v":"00:00:00"},{"$f":"CAC!X122","v":"00:00:00"},{"$f":"CAC!AB122","v":"00:00:00"},{"$f":"CAC!AC122","v":"00:00:00"},null,null,null,null,"Pendência","Pendência","Pendência","Pendência"]
[{"$f":"CAC!A96","v":0},{"$f":"CAC!C123","v":0},{"$f":"CAC!B123","v":0},-44859,{"$f":"CAC!W123","v":"00:00:00"},{"$f":"CAC!X123","v":"00:00:00"},{"$f":"CAC!AB123","v":"00:00:00"},{"$f":"CAC!AC123","v":"00:00:00"},null,null,null,null,"Pendência","Pendência","Pendência","Pendência"]
[{"$f":"CAC!A97","v":0},{"$f":"CAC!C124","v":0},{"$f":"CAC!B124","v":0},-44859,{"$f":"CAC!W124","v":"00:00:00"},{"$f":"CAC!X124","v":"00:00:00"},{"$f":"CAC!AB124","v":"00:00:00"},{"$f":"CAC!AC124","v":"00:00:00"},null,null,null,null,"Pendência","Pendência","Pendência","Pendência"]
[{"$f":"CAC!A98","v":0},{"$f":"CAC!C125","v":0},{"$f":"CAC!B125","v":0},-44859,{"$f":"CAC!W125","v":"00:00:00"},{"$f":"CAC!X125","v":"00:00:00"},{"$f":"CAC!AB125","v":"00:00:00"},{"$f":"CAC!AC125","v":"00:00:00"},null,null,null,null,"Pendência","Pendência","Pendência","Pendência"]
[{"$f":"CAC!A99","v":0},{"$f":"CAC!C126","v":0},{"$f":"CAC!B126","v":0},-44859,{"$f":"CAC!W126","v":"00:00:00"},{"$f":"CAC!X126","v":"00:00:00"},{"$f":"CAC!AB126","v":"00:00:00"},{"$f":"CAC!AC126","v":"00:00:00"},null,null,null,null,"Pendência","Pendência","Pendência","Pendência"]
[{"$f":"CAC!A100","v":0},{"$f":"CAC!C127","v":0},{"$f":"CAC!B127","v":0},-44859,{"$f":"CAC!W127","v":"00:00:00"},{"$f":"CAC!X127","v":"00:00:00"},{"$f":"CAC!AB127","v":"00:00:00"},{"$f":"CAC!AC127","v":"00:00:00"},null,null,null,null,"Pendência","Pendência","Pendência","Pendência"]
[{"$f":"CAC!A101","v":0},{"$f":"CAC!C128","v":0},{"$f":"CAC!B128","v":0},-44859,{"$f":"CAC!W128","v":"00:00:00"},{"$f":"CAC!X128","v":"00:00:00"},{"$f":"CAC!AB128","v":"00:00:00"},{"$f":"CAC!AC128","v":"00:00:00"},null,null,null,null,"Pendência","Pendência","Pendência","Pendência"]
[{"$f":"CAC!A102","v":0},{"$f":"CAC!C129","v":0},{"$f":"CAC!B129","v":0},-44859,{"$f":"CAC!W129","v":"00:00:00"},{"$f":"CAC!X129","v":"00:00:00"},{"$f":"CAC!AB129","v":"00:00:00"},{"$f":"CAC!AC129","v":"00:00:00"},null,null,null,null,"Pendência","Pendência","Pendência","Pendência"]
[{"$f":"CAC!A103","v":0},{"$f":"CAC!C130","v":0},{"$f":"CAC!B130","v":0},-44859,{"$f":"CAC!W130","v":"00:00:00"},{"$f":"CAC!X130","v":"00:00:00"},{"$f":"CAC!AB130","v":"00:00:00"},{"$f":"CAC!AC130","v":"00:00:00"},null,null,null,null,"Pendência","Pendência","Pendência","Pendência"]
[{"$f":"CAC!A104","v":0},{"$f":"CAC!C131","v":0},{"$f":"CAC!B131","v":0},-44859,{"$f":"CAC!W131","v":"00:00:00"},{"$f":"CAC!X131","v":"00:00:00"},{"$f":"CAC!AB131","v":"00:00:00"},{"$f":"CAC!AC131","v":"00:00:00"},null,null,null,null,"Pendência","Pendência","Pendência","Pendência"]
[{"$f":"CAC!A105","v":0},{"$f":"CAC!C132","v":0},{"$f":"CAC!B132","v":0},-44859,{"$f":"CAC!W132","v":"00:00:00"},{"$f":"CAC!X132","v":"00:00:00"},{"$f":"CAC!AB132","v":"00:00:00"},{"$f":"CAC!AC132","v":"00:00:00"},null,null,null,null,"Pendência","Pendência","Pendência","Pendência"]
[{"$f":"CAC!A106","v":0},{"$f":"CAC!C133","v":0},{"$f":"CAC!B133","v":0},-44859,{"$f":"CAC!W133","v":"00:00:00"},{"$f":"CAC!X133","v":"00:00:00"},{"$f":"CAC!AB133","v":"00:00:00"},{"$f":"CAC!AC133","v":"00:00:00"},null,null,null,null,"Pendência","Pendência","Pendência","Pendência"]
[{"$f":"CAC!A107","v":0},{"$f":"CAC!C134","v":0},{"$f":"CAC!B134","v":0},-44859,{"$f":"CAC!W134","v":"00:00:00"},{"$f":"CAC!X134","v":"00:00:00"},{"$f":"CAC!AB134","v":"00:00:00"},{"$f":"CAC!AC134","v":"00:00:00"},null,null,null,null,"Pendência","Pendência","Pendência","Pendência"]
[{"$f":"CAC!A108","v":0},{"$f":"CAC!C135","v":0},{"$f":"CAC!B135","v":0},-44859,{"$f":"CAC!W135","v":"00:00:00"},{"$f":"CAC!X135","v":"00:00:00"},{"$f":"CAC!AB135","v":"00:00:00"},{"$f":"CAC!AC135","v":"00:00:00"},null,null,null,null,"Pendência","Pendência","Pendência","Pendência"]
[{"$f":"CAC!A109","v":0},{"$f":"CAC!C136","v":0},{"$f":"CAC!B136","v":0},-44859,{"$f":"CAC!W136","v":"00:00:00"},{"$f":"CAC!X136","v":"00:00:00"},{"$f":"CAC!AB136","v":"00:00:00"},{"$f":"CAC!AC136","v":"00:00:00"},null,null,null,null,"Pendência","Pendência","Pendência","Pendência"]
[{"$f":"CAC!A110","v":0},{"$f":"CAC!C137","v":0},{"$f":"CAC!B137","v":0},-44859,{"$f":"CAC!W137","v":"00:00:00"},{"$f":"CAC!X137","v":"00:00:00"},{"$f":"CAC!AB137","v":"00:00:00"},{"$f":"CAC!AC137","v":"00:00:00"},null,null,null,null,"Pendência","Pendência","Pendência","Pendência"]
[{"$f":"CAC!A111","v":0},{"$f":"CAC!C138","v":0},{"$f":"CAC!B138","v":0},-44859,{"$f":"CAC!W138","v":"00:00:00"},{"$f":"CAC!X138","v":"00:00:00"},{"$f":"CAC!AB138","v":"00:00:00"},{"$f":"CAC!AC138","v":"00:00:00"},null,null,null,null,"Pendência","Pendência","Pendência","Pendência"]
[{"$f":"CAC!A112","v":0},{"$f":"CAC!C139","v":0},{"$f":"CAC!B139","v":0},-44859,{"$f":"CAC!W139","v":"00:00:00"},{"$f":"CAC!X139","v":"00:00:00"},{"$f":"CAC!AB139","v":"00:00:00"},{"$f":"CAC!AC139","v":"00:00:00"},null,null,null,null,"Pendência","Pendência","Pendência","Pendência"]
[{"$f":"CAC!A140","v":0},{"$f":"CAC!C140","v":0},{"$f":"CAC!B140","v":0},-44859,{"$f":"CAC!W140","v":"00:00:00"},{"$f":"CAC!X140","v":"00:00:00"},{"$f":"CAC!AB140","v":"00:00:00"},{"$f":"CAC!AC140","v":"00:00:00"},null,null,null,null,"Pendência","Pendência","Pendência","Pendência"]
[{"$f":"CAC!A141","v":0},{"$f":"CAC!C141","v":0},{"$f":"CAC!B141","v":0},-44859,{"$f":"CAC!W141","v":"00:00:00"},{"$f":"CAC!X141","v":"00:00:00"},{"$f":"CAC!AB141","v":"00:00:00"},{"$f":"CAC!AC141","v":"00:00:00"},null,null,null,null,"Pendência","Pendência","Pendência","Pendência"]
[{"$f":"CAC!A142","v":0},{"$f":"CAC!C142","v":0},{"$f":"CAC!B142","v":0},-44859,{"$f":"CAC!W142","v":"00:00:00"},{"$f":"CAC!X142","v":"00:00:00"},{"$f":"CAC!AB142","v":"00:00:00"},{"$f":"CAC!AC142","v":"00:00:00"},null,null,null,null,"Pendência","Pendência","Pendência","Pendência"]
[{"$f":"CAC!A143","v":0},{"$f":"CAC!C143","v":0},{"$f":"CAC!B143","v":0},-44859,{"$f":"CAC!W143","v":"00:00:00"},{"$f":"CAC!X143","v":"00:00:00"},{"$f":"CAC!AB143","v":"00:00:00"},{"$f":"CAC!AC143","v":"00:00:00"},null,null,null,null,"Pendência","Pendência","Pendência","Pendência"]
[{"$f":"CAC!A144","v":0},{"$f":"CAC!C144","v":0},{"$f":"CAC!B144","v":0},-44859,{"$f":"CAC!W144","v":"00:00:00"},{"$f":"CAC!X144","v":"00:00:00"},{"$f":"CAC!AB144","v":"00:00:00"},{"$f":"CAC!AC144","v":"00:00:00"},null,null,null,null,"Pendência","Pendência","Pendência","Pendência"]
[{"$f":"CAC!A145","v":0},{"$f":"CAC!C145","v":0},{"$f":"CAC!B145","v":0},-44859,{"$f":"CAC!W145","v":"00:00:00"},{"$f":"CAC!X145","v":"00:00:00"},{"$f":"CAC!AB145","v":"00:00:00"},{"$f":"CAC!AC145","v":"00:00:00"},null,null,null,null,"Pendência","Pendência","Pendência","Pendência"]
[{"$f":"CAC!A146","v":0},{"$f":"CAC!C146","v":0},{"$f":"CAC!B146","v":0},-44859,{"$f":"CAC!W146","v":"00:00:00"},{"$f":"CAC!X146","v":"00:00:00"},{"$f":"CAC!AB146","v":"00:00:00"},{"$f":"CAC!AC146","v":"00:00:00"},null,null,null,null,"Pendência","Pendência","Pendência","Pendência"]
[{"$f":"CAC!A147","v":0},{"$f":"CAC!C147","v":0},{"$f":"CAC!B147","v":0},-44859,{"$f":"CAC!W147","v":"00:00:00"},{"$f":"CAC!X147","v":"00:00:00"},{"$f":"CAC!AB147","v":"00:00:00"},{"$f":"CAC!AC147","v":"00:00:00"},null,null,null,null,"Pendência","Pendência","Pendência","Pendência"]
[{"$f":"CAC!A148","v":0},{"$f":"CAC!C148","v":0},{"$f":"CAC!B148","v":0},-44859,{"$f":"CAC!W148","v":"00:00:00"},{"$f":"CAC!X148","v":"00:00:00"},{"$f":"CAC!AB148","v":"00:00:00"},{"$f":"CAC!AC148","v":"00:00:00"},null,null,null,null,"Pendência","Pendência","Pendência","Pendência"]
[{"$f":"CAC!A149","v":0},{"$f":"CAC!C149","v":0},{"$f":"CAC!B149","v":0},-44859,{"$f":"CAC!W149","v":"00:00:00"},{"$f":"CAC!X149","v":"00:00:00"},{"$f":"CAC!AB149","v":"00:00:00"},{"$f":"CAC!AC149","v":"00:00:00"},null,null,null,null,"Pendência","Pendência","Pendência","Pendência"]
[{"$f":"CAC!A150","v":0},{"$f":"CAC!C150","v":0},{"$f":"CAC!B150","v":0},-44859,{"$f":"CAC!W150","v":"00:00:00"},{"$f":"CAC!X150","v":"00:00:00"},{"$f":"CAC!AB150","v":"00:00:00"},{"$f":"CAC!AC150","v":"00:00:00"},null,null,null,null,"Pendência","Pendência","Pendência","Pendência"]
[{"$f":"CAC!A151","v":0},{"$f":"CAC!C151","v":0},{"$f":"CAC!B151","v":0},-44859,{"$f":"CAC!W151","v":"00:00:00"},{"$f":"CAC!X151","v":"00:00:00"},{"$f":"CAC!AB151","v":"00:00:00"},{"$f":"CAC!AC151","v":"00:00:00"},null,null,null,null,"Pendência","Pendência","Pendência","Pendência"]
[{"$f":"CAC!A152","v":0},{"$f":"CAC!C152","v":0},{"$f":"CAC!B152","v":0},-44859,{"$f":"CAC!W152","v":"00:00:00"},{"$f":"CAC!X152","v":"00:00:00"},{"$f":"CAC!AB152","v":"00:00:00"},{"$f":"CAC!AC152","v":"00:00:00"},null,null,null,null,"Pendência","Pendência","Pendência","Pendência"]
[{"$f":"CAC!A153","v":0},{"$f":"CAC!C153","v":0},{"$f":"CAC!B153","v":0},-44859,{"$f":"CAC!W153","v":"00:00:00"},{"$f":"CAC!X153","v":"00:00:00"},{"$f":"CAC!AB153","v":"00:00:00"},{"$f":"CAC!AC153","v":"00:00:00"},null,null,null,null,"Pendência","Pendência","Pendência","Pendência"]
[{"$f":"CAC!A154","v":0},{"$f":"CAC!C154","v":0},{"$f":"CAC!B154","v":0},-44859,{"$f":"CAC!W154","v":"00:00:00"},{"$f":"CAC!X154","v":"00:00:00"},{"$f":"CAC!AB154","v":"00:00:00"},{"$f":"CAC!AC154","v":"00:00:00"},null,null,null,null,"Pendência","Pendência","Pendência","Pendência"]
[{"$f":"CAC!A155","v":0},{"$f":"CAC!C155","v":0},{"$f":"CAC!B155","v":0},-44859,{"$f":"CAC!W155","v":"00:00:00"},{"$f":"CAC!X155","v":"00:00:00"},{"$f":"CAC!AB155","v":"00:00:00"},{"$f":"CAC!AC155","v":"00:00:00"},null,null,null,null,"Pendência","Pendência","Pendência","Pendência"]
[{"$f":"CAC!A156","v":0},{"$f":"CAC!C156","v":0},{"$f":"CAC!B156","v":0},-44859,{"$f":"CAC!W156","v":"00:00:00"},{"$f":"CAC!X156","v":"00:00:00"},{"$f":"CAC!AB156","v":"00:00:00"},{"$f":"CAC!AC156","v":"00:00:00"},null,null,null,null,"Pendência","Pendência","Pendência","Pendência"]
[{"$f":"CAC!A157","v":0},{"$f":"CAC!C157","v":0},{"$f":"CAC!B157","v":0},-44859,{"$f":"CAC!W157","v":"00:00:00"},{"$f":"CAC!X157","v":"00:00:00"},{"$f":"CAC!AB157","v":"00:00:00"},{"$f":"CAC!AC157","v":"00:00:00"},null,null,null,null,"Pendência","Pendência","Pendência","Pendência"]
[{"$f":"CAC!A158","v":0},{"$f":"CAC!C158","v":0},{"$f":"CAC!B158","v":0},-44859,{"$f":"CAC!W158","v":"00:00:00"},{"$f":"CAC!X158","v":"00:00:00"},{"$f":"CAC!AB158","v":"00:00:00"},{"$f":"CAC!AC158","v":"00:00:00"},null,null,null,null,"Pendência","Pendência","Pendência","Pendência"]
[{"$f":"CAC!A159","v":0},{"$f":"CAC!C159","v":0},{"$f":"CAC!B159","v":0},-44859,{"$f":"CAC!W159","v":"00:00:00"},{"$f":"CAC!X159","v":"00:00:00"},{"$f":"CAC!AB159","v":"00:00:00"},{"$f":"CAC!AC159","v":"00:00:00"},null,null,null,null,"Pendência","Pendência","Pendência","Pendência"]
[{"$f":"CAC!A160","v":0},{"$f":"CAC!C160","v":0},{"$f":"CAC!B160","v":0},-44859,{"$f":"CAC!W160","v":"00:00:00"},{"$f":"CAC!X160","v":"00:00:00"},{"$f":"CAC!AB160","v":"00:00:00"},{"$f":"CAC!AC160","v":"00:00:00"},null,null,null,null,"Pendência","Pendência","Pendência","Pendência"]
[{"$f":"CAC!A161","v":0},{"$f":"CAC!C161","v":0},{"$f":"CAC!B161","v":0},-44859,{"$f":"CAC!W161","v":"00:00:00"},{"$f":"CAC!X161","v":"00:00:00"},{"$f":"CAC!AB161","v":"00:00:00"},{"$f":"CAC!AC161","v":"00:00:00"},null,null,null,null,"Pendência","Pendência","Pendência","Pendência"]
[{"$f":"CAC!A162","v":0},{"$f":"CAC!C162","v":0},{"$f":"CAC!B162","v":0},{"$f":"H131-TODAY()","v":-44859},{"$f":"CAC!W162","v":"00:00:00"},{"$f":"CAC!X162","v":"00:00:00"},{"$f":"CAC!AB162","v":"00:00:00"},{"$f":"CAC!AC162","v":"00:00:00"},null,null,null,null,{"$f":"IF(E131=\"---\",\"N/A\",IF(AND(I131=\"\",NOW()-E131<0),\"Em dia\",IF(AND(I131=\"\",NOW()-E131>0),\"Pendência\",IF(I131>E131,\"Entregue com atraso\",\"Entregue\"))))","v":"Pendência"},{"$f":"IF(F131=\"---\",\"N/A\",IF(AND(J131=\"\",NOW()-F131<0),\"Em dia\",IF(AND(J131=\"\",NOW()-F131>0),\"Pendência\",IF(J131>F131,\"Entregue com atraso\",\"Entregue\"))))","v":"Pendência"},{"$f":"IF(G131=\"---\",\"N/A\",IF(AND(K131=\"\",NOW()-G131<0),\"Em dia\",IF(AND(K131=\"\",NOW()-G131>0),\"Pendência\",IF(K131>G131,\"Contratado com atraso\",\"Contratado\"))))","v":"Pendência"},{"$f":"IF(AND(L131=\"\",NOW()-H131<0),\"Em dia\",IF(AND(L131=\"\",NOW()-H131>0),\"Pendência\",IF(L131>H131,\"Contratado com atraso\",\"Contratado\")))","v":"Pendência"}]
[{"$f":"CAC!A163","v":0},{"$f":"CAC!C163","v":0},{"$f":"CAC!B163","v":0},-44859,{"$f":"CAC!W163","v":"00:00:00"},{"$f":"CAC!X163","v":"00:00:00"},{"$f":"CAC!AB163","v":"00:00:00"},{"$f":"CAC!AC163","v":"00:00:00"},null,null,null,null,"Pendência","Pendência","Pendência","Pendência"]
[{"$f":"CAC!A164","v":0},{"$f":"CAC!C164","v":0},{"$f":"CAC!B164","v":0},-44859,{"$f":"CAC!W164","v":"00:00:00"},{"$f":"CAC!X164","v":"00:00:00"},{"$f":"CAC!AB164","v":"00:00:00"},{"$f":"CAC!AC164","v":"00:00:00"},null,null,null,null,"Pendência","Pendência","Pendência","Pendência"]
[{"$f":"CAC!A165","v":0},{"$f":"CAC!C165","v":0},{"$f":"CAC!B165","v":0},-44859,{"$f":"CAC!W165","v":"00:00:00"},{"$f":"CAC!X165","v":"00:00:00"},{"$f":"CAC!AB165","v":"00:00:00"},{"$f":"CAC!AC165","v":"00:00:00"},null,null,null,null,"Pendência","Pendência","Pendência","Pendência"]
[{"$f":"CAC!A166","v":0},{"$f":"CAC!C166","v":0},{"$f":"CAC!B166","v":0},-44859,{"$f":"CAC!W166","v":"00:00:00"},{"$f":"CAC!X166","v":"00:00:00"},{"$f":"CAC!AB166","v":"00:00:00"},{"$f":"CAC!AC166","v":"00:00:00"},null,null,null,null,"Pendência","Pendência","Pendência","Pendência"]
[{"$f":"CAC!A167","v":0},{"$f":"CAC!C167","v":0},{"$f":"CAC!B167","v":0},-44859,{"$f":"CAC!W167","v":"00:00:00"},{"$f":"CAC!X167","v":"00:00:00"},{"$f":"CAC!AB167","v":"00:00:00"},{"$f":"CAC!AC167","v":"00:00:00"},null,null,null,null,"Pendência","Pendência","Pendência","Pendência"]
[{"$f":"CAC!A168","v":0},{"$f":"CAC!C168","v":0},{"$f":"CAC!B168","v":0},-44859,{"$f":"CAC!W168","v":"00:00:00"},{"$f":"CAC!X168","v":"00:00:00"},{"$f":"CAC!AB168","v":"00:00:00"},{"$f":"CAC!AC168","v":"00:00:00"},null,null,null,null,"Pendência","Pendência","Pendência","Pendência"]
[{"$f":"CAC!A169","v":0},{"$f":"CAC!C169","v":0},{"$f":"CAC!B169","v":0},-44859,{"$f":"CAC!W169","v":"00:00:00"},{"$f":"CAC!X169","v":"00:00:00"},{"$f":"CAC!AB169","v":"00:00:00"},{"$f":"CAC!AC169","v":"00:00:00"},null,null,null,null,"Pendência","Pendência","Pendência","Pendência"]
[{"$f":"CAC!A170","v":0},{"$f":"CAC!C170","v":0},{"$f":"CAC!B170","v":0},-44859,{"$f":"CAC!W170","v":"00:00:00"},{"$f":"CAC!X170","v":"00:00:00"},{"$f":"CAC!AB170","v":"00:00:00"},{"$f":"CAC!AC170","v":"00:00:00"},null,null,null,null,"Pendência","Pendência","Pendência","Pendência"]
[{"$f":"CAC!A171","v":0},{"$f":"CAC!C171","v":0},{"$f":"CAC!B171","v":0},-44859,{"$f":"CAC!W171","v":"00:00:00"},{"$f":"CAC!X171","v":"00:00:00"},{"$f":"CAC!AB171","v":"00:00:00"},{"$f":"CAC!AC171","v":"00:00:00"},null,null,null,null,"Pendência","Pendência","Pendência","Pendência"]
[{"$f":"CAC!A172","v":0},{"$f":"CAC!C172","v":0},{"$f":"CAC!B172","v":0},-44859,{"$f":"CAC!W172","v":"00:00:00"},{"$f":"CAC!X172","v":"00:00:00"},{"$f":"CAC!AB172","v":"00:00:00"},{"$f":"CAC!AC172","v":"00:00:00"},null,null,null,null,"Pendência","Pendência","Pendência","Pendência"]
[{"$f":"CAC!A173","v":0},{"$f":"CAC!C173","v":0},{"$f":"CAC!B173","v":0},-44859,{"$f":"CAC!W173","v":"00:00:00"},{"$f":"CAC!X173","v":"00:00:00"},{"$f":"CAC!AB173","v":"00:00:00"},{"$f":"CAC!AC173","v":"00:00:00"},null,null,null,null,"Pendência","Pendência","Pendência","Pendência"]
[{"$f":"CAC!A174","v":0},{"$f":"CAC!C174","v":0},{"$f":"CAC!B174","v":0},-44859,{"$f":"CAC!W174","v":"00:00:00"},{"$f":"CAC!X174","v":"00:00:00"},{"$f":"CAC!AB174","v":"00:00:00"},{"$f":"CAC!AC174","v":"00:00:00"},null,null,null,null,"Pendência","Pendência","Pendência","Pendência"]
[{"$f":"CAC!A175","v":0},{"$f":"CAC!C175","v":0},{"$f":"CAC!B175","v":0},-44859,{"$f":"CAC!W175","v":"00:00:00"},{"$f":"CAC!X175","v":"00:00:00"},{"$f":"CAC!AB175","v":"00:00:00"},{"$f":"CAC!AC175","v":"00:00:00"},null,null,null,null,"Pendência","Pendência","Pendência","Pendência"]
[{"$f":"CAC!A176","v":0},{"$f":"CAC!C176","v":0},{"$f":"CAC!B176","v":0},-44859,{"$f":"CAC!W176","v":"00:00:00"},{"$f":"CAC!X176","v":"00:00:00"},{"$f":"CAC!AB176","v":"00:00:00"},{"$f":"CAC!AC176","v":"00:00:00"},null,null,null,null,"Pendência","Pendência","Pendência","Pendência"]
[{"$f":"CAC!A177","v":0},{"$f":"CAC!C177","v":0},{"$f":"CAC!B177","v":0},-44859,{"$f":"CAC!W177","v":"00:00:00"},{"$f":"CAC!X177","v":"00:00:00"},{"$f":"CAC!AB177","v":"00:00:00"},{"$f":"CAC!AC177","v":"00:00:00"},null,null,null,null,"Pendência","Pendência","Pendência","Pendência"]
[{"$f":"CAC!A178","v":0},{"$f":"CAC!C178","v":0},{"$f":"CAC!B178","v":0},-44859,{"$f":"CAC!W178","v":"00:00:00"},{"$f":"CAC!X178","v":"00:00:00"},{"$f":"CAC!AB178","v":"00:00:00"},{"$f":"CAC!AC178","v":"00:00:00"},null,null,null,null,"Pendência","Pendência","Pendência","Pendência"]
[{"$f":"CAC!A179","v":0},{"$f":"CAC!C179","v":0},{"$f":"CAC!B179","v":0},-44859,{"$f":"CAC!W179","v":"00:00:00"},{"$f":"CAC!X179","v":"00:00:00"},{"$f":"CAC!AB179","v":"00:00:00"},{"$f":"CAC!AC179","v":"00:00:00"},null,null,null,null,"Pendência","Pendência","Pendência","Pendência"]
[{"$f":"CAC!A180","v":0},{"$f":"CAC!C180","v":0},{"$f":"CAC!B180","v":0},-44859,{"$f":"CAC!W180","v":"00:00:00"},{"$f":"CAC!X180","v":"00:00:00"},{"$f":"CAC!AB180","v":"00:00:00"},{"$f":"CAC!AC180","v":"00:00:00"},null,null,null,null,"Pendência","Pendência","Pendência","Pendência"]
[{"$f":"CAC!A181","v":0},{"$f":"CAC!C181","v":0},{"$f":"CAC!B181","v":0},-44859,{"$f":"CAC!W181","v":"00:00:00"},{"$f":"CAC!X181","v":"00:00:00"},{"$f":"CAC!AB181","v":"00:00:00"},{"$f":"CAC!AC181","v":"00:00:00"},null,null,null,null,"Pendência","Pendência","Pendência","Pendência"]
[{"$f":"CAC!A182","v":0},{"$f":"CAC!C182","v":0},{"$f":"CAC!B182","v":0},-44859,{"$f":"CAC!W182","v":"00:00:00"},{"$f":"CAC!X182","v":"00:00:00"},{"$f":"CAC!AB182","v":"00:00:00"},{"$f":"CAC!AC182","v":"00:00:00"},null,null,null,null,"Pendência","Pendência","Pendência","Pendência"]
[{"$f":"CAC!A183","v":0},{"$f":"CAC!C183","v":0},{"$f":"CAC!B183","v":0},-44859,{"$f":"CAC!W183","v":"00:00:00"},{"$f":"CAC!X183","v":"00:00:00"},{"$f":"CAC!AB183","v":"00:00:00"},{"$f":"CAC!AC183","v":"00:00:00"},null,null,null,null,"Pendência","Pendência","Pendência","Pendência"]
[{"$f":"CAC!A184","v":0},{"$f":"CAC!C184","v":0},{"$f":"CAC!B184","v":0},-44859,{"$f":"CAC!W184","v":"00:00:00"},{"$f":"CAC!X184","v":"00:00:00"},{"$f":"CAC!AB184","v":"00:00:00"},{"$f":"CAC!AC184","v":"00:00:00"},null,null,null,null,"Pendência","Pendência","Pendência","Pendência"]
[{"$f":"CAC!A185","v":0},{"$f":"CAC!C185","v":0},{"$f":"CAC!B185","v":0},-44859,{"$f":"CAC!W185","v":"00:00:00"},{"$f":"CAC!X185","v":"00:00:00"},{"$f":"CAC!AB185","v":"00:00:00"},{"$f":"CAC!AC185","v":"00:00:00"},null,null,null,null,"Pendência","Pendência","Pendência","Pendência"]
[{"$f":"CAC!A186","v":0},{"$f":"CAC!C186","v":0},{"$f":"CAC!B186","v":0},-44859,{"$f":"CAC!W186","v":"00:00:00"},{"$f":"CAC!X186","v":"00:00:00"},{"$f":"CAC!AB186","v":"00:00:00"},{"$f":"CAC!AC186","v":"00:00:00"},null,null,null,null,"Pendência","Pendência","Pendência","Pendência"]
[{"$f":"CAC!A187","v":0},{"$f":"CAC!C187","v":0},{"$f":"CAC!B187","v":0},-44859,{"$f":"CAC!W187","v":"00:00:00"},{"$f":"CAC!X187","v":"00:00:00"},{"$f":"CAC!AB187","v":"00:00:00"},{"$f":"CAC!AC187","v":"00:00:00"},null,null,null,null,"Pendência","Pendência","Pendência","Pendência"]
[{"$f":"CAC!A188","v":0},{"$f":"CAC!C188","v":0},{"$f":"CAC!B188","v":0},-44859,{"$f":"CAC!W188","v":"00:00:00"},{"$f":"CAC!X188","v":"00:00:00"},{"$f":"CAC!AB188","v":"00:00:00"},{"$f":"CAC!AC188","v":"00:00:00"},null,null,null,null,"Pendência","Pendência","Pendência","Pendência"]
[{"$f":"CAC!A189","v":0},{"$f":"CAC!C189","v":0},{"$f":"CAC!B189","v":0},-44859,{"$f":"CAC!W189","v":"00:00:00"},{"$f":"CAC!X189","v":"00:00:00"},{"$f":"CAC!AB189","v":"00:00:00"},{"$f":"CAC!AC189","v":"00:00:00"},null,null,null,null,"Pendência","Pendência","Pendência","Pendência"]
[{"$f":"CAC!A190","v":0},{"$f":"CAC!C190","v":0},{"$f":"CAC!B190","v":0},-44859,{"$f":"CAC!W190","v":"00:00:00"},{"$f":"CAC!X190","v":"00:00:00"},{"$f":"CAC!AB190","v":"00:00:00"},{"$f":"CAC!AC190","v":"00:00:00"},null,null,null,null,"Pendência","Pendência","Pendência","Pendência"]
[{"$f":"CAC!A191","v":0},{"$f":"CAC!C191","v":0},{"$f":"CAC!B191","v":0},-44859,{"$f":"CAC!W191","v":"00:00:00"},{"$f":"CAC!X191","v":"00:00:00"},{"$f":"CAC!AB191","v":"00:00:00"},{"$f":"CAC!AC191","v":"00:00:00"},null,null,null,null,"Pendência","Pendência","Pendência","Pendência"]
[{"$f":"CAC!A192","v":0},{"$f":"CAC!C192","v":0},{"$f":"CAC!B192","v":0},-44859,{"$f":"CAC!W192","v":"00:00:00"},{"$f":"CAC!X192","v":"00:00:00"},{"$f":"CAC!AB192","v":"00:00:00"},{"$f":"CAC!AC192","v":"00:00:00"},null,null,null,null,"Pendência","Pendência","Pendência","Pendência"]
[{"$f":"CAC!A193","v":0},{"$f":"CAC!C193","v":0},{"$f":"CAC!B193","v":0},-44859,{"$f":"CAC!W193","v":"00:00:00"},{"$f":"CAC!X193","v":"00:00:00"},{"$f":"CAC!AB193","v":"00:00:00"},{"$f":"CAC!AC193","v":"00:00:00"},null,null,null,null,"Pendência","Pendência","Pendência","Pendência"]
[{"$f":"CAC!A194","v":0},{"$f":"CAC!C194","v":0},{"$f":"CAC!B194","v":0},-44859,{"$f":"CAC!W194","v":"00:00:00"},{"$f":"CAC!X194","v":"00:00:00"},{"$f":"CAC!AB194","v":"00:00:00"},{"$f":"CAC!AC194","v":"00:00:00"},null,null,null,null,"Pendência","Pendência","Pendência","Pendência"]
[{"$f":"CAC!A195","v":0},{"$f":"CAC!C195","v":0},{"$f":"CAC!B195","v":0},-44859,{"$f":"CAC!W195","v":"00:00:00"},{"$f":"CAC!X195","v":"00:00:00"},{"$f":"CAC!AB195","v":"00:00:00"},{"$f":"CAC!AC195","v":"00:00:00"},null,null,null,null,"Pendência","Pendência","Pendência","Pendência"]
[{"$f":"CAC!A196","v":0},{"$f":"CAC!C196","v":0},{"$f":"CAC!B196","v":0},-44859,{"$f":"CAC!W196","v":"00:00:00"},{"$f":"CAC!X196","v":"00:00:00"},{"$f":"CAC!AB196","v":"00:00:00"},{"$f":"CAC!AC196","v":"00:00:00"},null,null,null,null,"Pendência","Pendência","Pendência","Pendência"]
[{"$f":"CAC!A197","v":0},{"$f":"CAC!C197","v":0},{"$f":"CAC!B197","v":0},-44859,{"$f":"CAC!W197","v":"00:00:00"},{"$f":"CAC!X197","v":"00:00:00"},{"$f":"CAC!AB197","v":"00:00:00"},{"$f":"CAC!AC197","v":"00:00:00"},null,null,null,null,"Pendência","Pendência","Pendência","Pendência"]
[{"$f":"CAC!A198","v":0},{"$f":"CAC!C198","v":0},{"$f":"CAC!B198","v":0},-44859,{"$f":"CAC!W198","v":"00:00:00"},{"$f":"CAC!X198","v":"00:00:00"},{"$f":"CAC!AB198","v":"00:00:00"},{"$f":"CAC!AC198","v":"00:00:00"},null,null,null,null,"Pendência","Pendência","Pendência","Pendência"]
[{"$f":"CAC!A199","v":0},{"$f":"CAC!C199","v":0},{"$f":"CAC!B199","v":0},-44859,{"$f":"CAC!W199","v":"00:00:00"},{"$f":"CAC!X199","v":"00:00:00"},{"$f":"CAC!AB199","v":"00:00:00"},{"$f":"CAC!AC199","v":"00:00:00"},null,null,null,null,"Pendência","Pendência","Pendência","Pendência"]
[{"$f":"CAC!A200","v":0},{"$f":"CAC!C200","v":0},{"$f":"CAC!B200","v":0},-44859,{"$f":"CAC!W200","v":"00:00:00"},{"$f":"CAC!X200","v":"00:00:00"},{"$f":"CAC!AB200","v":"00:00:00"},{"$f":"CAC!AC200","v":"00:00:00"},null,null,null,null,"Pendência","Pendência","Pendência","Pendência"]
[{"$f":"CAC!A201","v":0},{"$f":"CAC!C201","v":0},{"$f":"CAC!B201","v":0},-44859,{"$f":"CAC!W201","v":"00:00:00"},{"$f":"CAC!X201","v":"00:00:00"},{"$f":"CAC!AB201","v":"00:00:00"},{"$f":"CAC!AC201","v":"00:00:00"},null,null,null,null,"Pendência","Pendência","Pendência","Pendência"]
[{"$f":"CAC!A202","v":0},{"$f":"CAC!C202","v":0},{"$f":"CAC!B202","v":0},-44859,{"$f":"CAC!W202","v":"00:00:00"},{"$f":"CAC!X202","v":"00:00:00"},{"$f":"CAC!AB202","v":"00:00:00"},{"$f":"CAC!AC202","v":"00:00:00"},null,null,null,null,"Pendência","Pendência","Pendência","Pendência"]
[{"$f":"CAC!A203","v":0},{"$f":"CAC!C203","v":0},{"$f":"CAC!B203","v":0},-44859,{"$f":"CAC!W203","v":"00:00:00"},{"$f":"CAC!X203","v":"00:00:00"},{"$f":"CAC!AB203","v":"00:00:00"},{"$f":"CAC!AC203","v":"00:00:00"},null,null,null,null,"Pendência","Pendência","Pendência","Pendência"]
[{"$f":"CAC!A204","v":0},{"$f":"CAC!C204","v":0},{"$f":"CAC!B204","v":0},-44859,{"$f":"CAC!W204","v":"00:00:00"},{"$f":"CAC!X204","v":"00:00:00"},{"$f":"CAC!AB204","v":"00:00:00"},{"$f":"CAC!AC204","v":"00:00:00"},null,null,null,null,"Pendência","Pendência","Pendência","Pendência"]
[{"$f":"CAC!A205","v":0},{"$f":"CAC!C205","v":0},{"$f":"CAC!B205","v":0},-44859,{"$f":"CAC!W205","v":"00:00:00"},{"$f":"CAC!X205","v":"00:00:00"},{"$f":"CAC!AB205","v":"00:00:00"},{"$f":"CAC!AC205","v":"00:00:00"},null,null,null,null,"Pendência","Pendência","Pendência","Pendência"]
[{"$f":"CAC!A206","v":0},{"$f":"CAC!C206","v":0},{"$f":"CAC!B206","v":0},-44859,{"$f":"CAC!W206","v":"00:00:00"},{"$f":"CAC!X206","v":"00:00:00"},{"$f":"CAC!AB206","v":"00:00:00"},{"$f":"CAC!AC206","v":"00:00:00"},null,null,null,null,"Pendência","Pendência","Pendência","Pendência"]
[{"$f":"CAC!A207","v":0},{"$f":"CAC!C207","v":0},{"$f":"CAC!B207","v":0},-44859,{"$f":"CAC!W207","v":"00:00:00"},{"$f":"CAC!X207","v":"00:00:00"},{"$f":"CAC!AB207","v":"00:00:00"},{"$f":"CAC!AC207","v":"00:00:00"},null,null,null,null,"Pendência","Pendência","Pendência","Pendência"]
[{"$f":"CAC!A208","v":0},{"$f":"CAC!C208","v":0},{"$f":"CAC!B208","v":0},-44859,{"$f":"CAC!W208","v":"00:00:00"},{"$f":"CAC!X208","v":"00:00:00"},{"$f":"CAC!AB208","v":"00:00:00"},{"$f":"CAC!AC208","v":"00:00:00"},null,null,null,null,"Pendência","Pendência","Pendência","Pendência"]
[{"$f":"CAC!A209","v":0},{"$f":"CAC!C209","v":0},{"$f":"CAC!B209","v":0},-44859,{"$f":"CAC!W209","v":"00:00:00"},{"$f":"CAC!X209","v":"00:00:00"},{"$f":"CAC!AB209","v":"00:00:00"},{"$f":"CAC!AC209","v":"00:00:00"},null,null,null,null,"Pendência","Pendência","Pendência","Pendência"]
[{"$f":"CAC!A210","v":0},{"$f":"CAC!C210","v":0},{"$f":"CAC!B210","v":0},-44859,{"$f":"CAC!W210","v":"00:00:00"},{"$f":"CAC!X210","v":"00:00:00"},{"$f":"CAC!AB210","v":"00:00:00"},{"$f":"CAC!AC210","v":"00:00:00"},null,null,null,null,"Pendência","Pendência","Pendência","Pendência"]
[{"$f":"CAC!A211","v":0},{"$f":"CAC!C211","v":0},{"$f":"CAC!B211","v":0},-44859,{"$f":"CAC!W211","v":"00:00:00"},{"$f":"CAC!X211","v":"00:00:00"},{"$f":"CAC!AB211","v":"00:00:00"},{"$f":"CAC!AC211","v":"00:00:00"},null,null,null,null,"Pendência","Pendência","Pendência","Pendência"]
[{"$f":"CAC!A212","v":0},{"$f":"CAC!C212","v":0},{"$f":"CAC!B212","v":0},-44859,{"$f":"CAC!W212","v":"00:00:00"},{"$f":"CAC!X212","v":"00:00:00"},{"$f":"CAC!AB212","v":"00:00:00"},{"$f":"CAC!AC212","v":"00:00:00"},null,null,null,null,"Pendência","Pendência","Pendência","Pendência"]
[{"$f":"CAC!A213","v":0},{"$f":"CAC!C213","v":0},{"$f":"CAC!B213","v":0},-44859,{"$f":"CAC!W213","v":"00:00:00"},{"$f":"CAC!X213","v":"00:00:00"},{"$f":"CAC!AB213","v":"00:00:00"},{"$f":"CAC!AC213","v":"00:00:00"},null,null,null,null,"Pendência","Pendência","Pendência","Pendência"]
[{"$f":"CAC!A214","v":0},{"$f":"CAC!C214","v":0},{"$f":"CAC!B214","v":0},-44859,{"$f":"CAC!W214","v":"00:00:00"},{"$f":"CAC!X214","v":"00:00:00"},{"$f":"CAC!AB214","v":"00:00:00"},{"$f":"CAC!AC214","v":"00:00:00"},null,null,null,null,"Pendência","Pendência","Pendência","Pendência"]
[{"$f":"CAC!A215","v":0},{"$f":"CAC!C215","v":0},{"$f":"CAC!B215","v":0},-44859,{"$f":"CAC!W215","v":"00:00:00"},{"$f":"CAC!X215","v":"00:00:00"},{"$f":"CAC!AB215","v":"00:00:00"},{"$f":"CAC!AC215","v":"00:00:00"},null,null,null,null,"Pendência","Pendência","Pendência","Pendência"]
[{"$f":"CAC!A216","v":0},{"$f":"CAC!C216","v":0},{"$f":"CAC!B216","v":0},-44859,{"$f":"CAC!W216","v":"00:00:00"},{"$f":"CAC!X216","v":"00:00:00"},{"$f":"CAC!AB216","v":"00:00:00"},{"$f":"CAC!AC216","v":"00:00:00"},null,null,null,null,"Pendência","Pendência","Pendência","Pendência"]
[{"$f":"CAC!A217","v":0},{"$f":"CAC!C217","v":0},{"$f":"CAC!B217","v":0},-44859,{"$f":"CAC!W217","v":"00:00:00"},{"$f":"CAC!X217","v":"00:00:00"},{"$f":"CAC!AB217","v":"00:00:00"},{"$f":"CAC!AC217","v":"00:00:00"},null,null,null,null,"Pendência","Pendência","Pendência","Pendência"]
[{"$f":"CAC!A218","v":0},{"$f":"CAC!C218","v":0},{"$f":"CAC!B218","v":0},-44859,{"$f":"CAC!W218","v":"00:00:00"},{"$f":"CAC!X218","v":"00:00:00"},{"$f":"CAC!AB218","v":"00:00:00"},{"$f":"CAC!AC218","v":"00:00:00"},null,null,null,null,"Pendência","Pendência","Pendência","Pendência"]
[{"$f":"CAC!A219","v":0},{"$f":"CAC!C219","v":0},{"$f":"CAC!B219","v":0},-44859,{"$f":"CAC!W219","v":"00:00:00"},{"$f":"CAC!X219","v":"00:00:00"},{"$f":"CAC!AB219","v":"00:00:00"},{"$f":"CAC!AC219","v":"00:00:00"},null,null,null,null,"Pendência","Pendência","Pendência","Pendência"]
[{"$f":"CAC!A220","v":0},{"$f":"CAC!C220","v":0},{"$f":"CAC!B220","v":0},-44859,{"$f":"CAC!W220","v":"00:00:00"},{"$f":"CAC!X220","v":"00:00:00"},{"$f":"CAC!AB220","v":"00:00:00"},{"$f":"CAC!AC220","v":"00:00:00"},null,null,null,null,"Pendência","Pendência","Pendência","Pendência"]
[{"$f":"CAC!A221","v":0},{"$f":"CAC!C221","v":0},{"$f":"CAC!B221","v":0},-44859,{"$f":"CAC!W221","v":"00:00:00"},{"$f":"CAC!X221","v":"00:00:00"},{"$f":"CAC!AB221","v":"00:00:00"},{"$f":"CAC!AC221","v":"00:00:00"},null,null,null,null,"Pendência","Pendência","Pendência","Pendência"]
[{"$f":"CAC!A222","v":0},{"$f":"CAC!C222","v":0},{"$f":"CAC!B222","v":0},-44859,{"$f":"CAC!W222","v":"00:00:00"},{"$f":"CAC!X222","v":"00:00:00"},{"$f":"CAC!AB222","v":"00:00:00"},{"$f":"CAC!AC222","v":"00:00:00"},null,null,null,null,"Pendência","Pendência","Pendência","Pendência"]
[{"$f":"CAC!A223","v":0},{"$f":"CAC!C223","v":0},{"$f":"CAC!B223","v":0},-44859,{"$f":"CAC!W223","v":"00:00:00"},{"$f":"CAC!X223","v":"00:00:00"},{"$f":"CAC!AB223","v":"00:00:00"},{"$f":"CAC!AC223","v":"00:00:00"},null,null,null,null,"Pendência","Pendência","Pendência","Pendência"]
[{"$f":"CAC!A224","v":0},{"$f":"CAC!C224","v":0},{"$f":"CAC!B224","v":0},-44859,{"$f":"CAC!W224","v":"00:00:00"},{"$f":"CAC!X224","v":"00:00:00"},{"$f":"CAC!AB224","v":"00:00:00"},{"$f":"CAC!AC224","v":"00:00:00"},null,null,null,null,"Pendência","Pendência","Pendência","Pendência"]
[{"$f":"CAC!A225","v":0},{"$f":"CAC!C225","v":0},{"$f":"CAC!B225","v":0},-44859,{"$f":"CAC!W225","v":"00:00:00"},{"$f":"CAC!X225","v":"00:00:00"},{"$f":"CAC!AB225","v":"00:00:00"},{"$f":"CAC!AC225","v":"00:00:00"},null,null,null,null,"Pendência","Pendência","Pendência","Pendência"]
[{"$f":"CAC!A226","v":0},{"$f":"CAC!C226","v":0},{"$f":"CAC!B226","v":0},{"$f":"H195-TODAY()","v":-44859},{"$f":"CAC!W226","v":"00:00:00"},{"$f":"CAC!X226","v":"00:00:00"},{"$f":"CAC!AB226","v":"00:00:00"},{"$f":"CAC!AC226","v":"00:00:00"},null,null,null,null,{"$f":"IF(E195=\"---\",\"N/A\",IF(AND(I195=\"\",NOW()-E195<0),\"Em dia\",IF(AND(I195=\"\",NOW()-E195>0),\"Pendência\",IF(I195>E195,\"Entregue com atraso\",\"Entregue\"))))","v":"Pendência"},{"$f":"IF(F195=\"---\",\"N/A\",IF(AND(J195=\"\",NOW()-F195<0),\"Em dia\",IF(AND(J195=\"\",NOW()-F195>0),\"Pendência\",IF(J195>F195,\"Entregue com atraso\",\"Entregue\"))))","v":"Pendência"},{"$f":"IF(G195=\"---\",\"N/A\",IF(AND(K195=\"\",NOW()-G195<0),\"Em dia\",IF(AND(K195=\"\",NOW()-G195>0),\"Pendência\",IF(K195>G195,\"Contratado com atraso\",\"Contratado\"))))","v":"Pendência"},{"$f":"IF(AND(L195=\"\",NOW()-H195<0),\"Em dia\",IF(AND(L195=\"\",NOW()-H195>0),\"Pendência\",IF(L195>H195,\"Contratado com atraso\",\"Contratado\")))","v":"Pendência"}]
[{"$f":"CAC!A227","v":0},{"$f":"CAC!C227","v":0},{"$f":"CAC!B227","v":0},-44859,{"$f":"CAC!W227","v":"00:00:00"},{"$f":"CAC!X227","v":"00:00:00"},{"$f":"CAC!AB227","v":"00:00:00"},{"$f":"CAC!AC227","v":"00:00:00"},null,null,null,null,"Pendência","Pendência","Pendência","Pendência"]
[{"$f":"CAC!A228","v":0},{"$f":"CAC!C228","v":0},{"$f":"CAC!B228","v":0},-44859,{"$f":"CAC!W228","v":"00:00:00"},{"$f":"CAC!X228","v":"00:00:00"},{"$f":"CAC!AB228","v":"00:00:00"},{"$f":"CAC!AC228","v":"00:00:00"},null,null,null,null,"Pendência","Pendência","Pendência","Pendência"]
[{"$f":"CAC!A229","v":0},{"$f":"CAC!C229","v":0},{"$f":"CAC!B229","v":0},-44859,{"$f":"CAC!W229","v":"00:00:00"},{"$f":"CAC!X229","v":"00:00:00"},{"$f":"CAC!AB229","v":"00:00:00"},{"$f":"CAC!AC229","v":"00:00:00"},null,null,null,null,"Pendência","Pendência","Pendência","Pendência"]
[{"$f":"CAC!A230","v":0},{"$f":"CAC!C230","v":0},{"$f":"CAC!B230","v":0},-44859,{"$f":"CAC!W230","v":"00:00:00"},{"$f":"CAC!X230","v":"00:00:00"},{"$f":"CAC!AB230","v":"00:00:00"},{"$f":"CAC!AC230","v":"00:00:00"},null,null,null,null,"Pendência","Pendência","Pendência","Pendência"]
[{"$f":"CAC!A231","v":0},{"$f":"CAC!C231","v":0},{"$f":"CAC!B231","v":0},-44859,{"$f":"CAC!W231","v":"00:00:00"},{"$f":"CAC!X231","v":"00:00:00"},{"$f":"CAC!AB231","v":"00:00:00"},{"$f":"CAC!AC231","v":"00:00:00"},null,null,null,null,"Pendência","Pendência","Pendência","Pendência"]
[{"$f":"CAC!A232","v":0},{"$f":"CAC!C232","v":0},{"$f":"CAC!B232","v":0},-44859,{"$f":"CAC!W232","v":"00:00:00"},{"$f":"CAC!X232","v":"00:00:00"},{"$f":"CAC!AB232","v":"00:00:00"},{"$f":"CAC!AC232","v":"00:00:00"},null,null,null,null,"Pendência","Pendência","Pendência","Pendência"]
[{"$f":"CAC!A233","v":0},{"$f":"CAC!C233","v":0},{"$f":"CAC!B233","v":0},-44859,{"$f":"CAC!W233","v":"00:00:00"},{"$f":"CAC!X233","v":"00:00:00"},{"$f":"CAC!AB233","v":"00:00:00"},{"$f":"CAC!AC233","v":"00:00:00"},null,null,null,null,"Pendência","Pendência","Pendência","Pendência"]
[{"$f":"CAC!A234","v":0},{"$f":"CAC!C234","v":0},{"$f":"CAC!B234","v":0},-44859,{"$f":"CAC!W234","v":"00:00:00"},{"$f":"CAC!X234","v":"00:00:00"},{"$f":"CAC!AB234","v":"00:00:00"},{"$f":"CAC!AC234","v":"00:00:00"},null,null,null,null,"Pendência","Pendência","Pendência","Pendência"]
[{"$f":"CAC!A235","v":0},{"$f":"CAC!C235","v":0},{"$f":"CAC!B235","v":0},-44859,{"$f":"CAC!W235","v":"00:00:00"},{"$f":"CAC!X235","v":"00:00:00"},{"$f":"CAC!AB235","v":"00:00:00"},{"$f":"CAC!AC235","v":"00:00:00"},null,null,null,null,"Pendência","Pendência","Pendência","Pendência"]
[{"$f":"CAC!A236","v":0},{"$f":"CAC!C236","v":0},{"$f":"CAC!B236","v":0},-44859,{"$f":"CAC!W236","v":"00:00:00"},{"$f":"CAC!X236","v":"00:00:00"},{"$f":"CAC!AB236","v":"00:00:00"},{"$f":"CAC!AC236","v":"00:00:00"},null,null,null,null,"Pendência","Pendência","Pendência","Pendência"]
[{"$f":"CAC!A237","v":0},{"$f":"CAC!C237","v":0},{"$f":"CAC!B237","v":0},-44859,{"$f":"CAC!W237","v":"00:00:00"},{"$f":"CAC!X237","v":"00:00:00"},{"$f":"CAC!AB237","v":"00:00:00"},{"$f":"CAC!AC237","v":"00:00:00"},null,null,null,null,"Pendência","Pendência","Pendência","Pendência"]
[{"$f":"CAC!A238","v":0},{"$f":"CAC!C238","v":0},{"$f":"CAC!B238","v":0},-44859,{"$f":"CAC!W238","v":"00:00:00"},{"$f":"CAC!X238","v":"00:00:00"},{"$f":"CAC!AB238","v":"00:00:00"},{"$f":"CAC!AC238","v":"00:00:00"},null,null,null,null,"Pendência","Pendência","Pendência","Pendência"]
[{"$f":"CAC!A239","v":0},{"$f":"CAC!C239","v":0},{"$f":"CAC!B239","v":0},-44859,{"$f":"CAC!W239","v":"00:00:00"},{"$f":"CAC!X239","v":"00:00:00"},{"$f":"CAC!AB239","v":"00:00:00"},{"$f":"CAC!AC239","v":"00:00:00"},null,null,null,null,"Pendência","Pendência","Pendência","Pendência"]
[{"$f":"CAC!A240","v":0},{"$f":"CAC!C240","v":0},{"$f":"CAC!B240","v":0},-44859,{"$f":"CAC!W240","v":"00:00:00"},{"$f":"CAC!X240","v":"00:00:00"},{"$f":"CAC!AB240","v":"00:00:00"},{"$f":"CAC!AC240","v":"00:00:00"},null,null,null,null,"Pendência","Pendência","Pendência","Pendência"]
[{"$f":"CAC!A241","v":0},{"$f":"CAC!C241","v":0},{"$f":"CAC!B241","v":0},-44859,{"$f":"CAC!W241","v":"00:00:00"},{"$f":"CAC!X241","v":"00:00:00"},{"$f":"CAC!AB241","v":"00:00:00"},{"$f":"CAC!AC241","v":"00:00:00"},null,null,null,null,"Pendência","Pendência","Pendência","Pendência"]
[{"$f":"CAC!A242","v":0},{"$f":"CAC!C242","v":0},{"$f":"CAC!B242","v":0},-44859,{"$f":"CAC!W242","v":"00:00:00"},{"$f":"CAC!X242","v":"00:00:00"},{"$f":"CAC!AB242","v":"00:00:00"},{"$f":"CAC!AC242","v":"00:00:00"},null,null,null,null,"Pendência","Pendência","Pendência","Pendência"]
[{"$f":"CAC!A243","v":0},{"$f":"CAC!C243","v":0},{"$f":"CAC!B243","v":0},-44859,{"$f":"CAC!W243","v":"00:00:00"},{"$f":"CAC!X243","v":"00:00:00"},{"$f":"CAC!AB243","v":"00:00:00"},{"$f":"CAC!AC243","v":"00:00:00"},null,null,null,null,"Pendência","Pendência","Pendência","Pendência"]
[{"$f":"CAC!A244","v":0},{"$f":"CAC!C244","v":0},{"$f":"CAC!B244","v":0},-44859,{"$f":"CAC!W244","v":"00:00:00"},{"$f":"CAC!X244","v":"00:00:00"},{"$f":"CAC!AB244","v":"00:00:00"},{"$f":"CAC!AC244","v":"00:00:00"},null,null,null,null,"Pendência","Pendência","Pendência","Pendência"]
[{"$f":"CAC!A245","v":0},{"$f":"CAC!C245","v":0},{"$f":"CAC!B245","v":0},-44859,{"$f":"CAC!W245","v":"00:00:00"},{"$f":"CAC!X245","v":"00:00:00"},{"$f":"CAC!AB245","v":"00:00:00"},{"$f":"CAC!AC245","v":"00:00:00"},null,null,null,null,"Pendência","Pendência","Pendência","Pendência"]
[{"$f":"CAC!A246","v":0},{"$f":"CAC!C246","v":0},{"$f":"CAC!B246","v":0},-44859,{"$f":"CAC!W246","v":"00:00:00"},{"$f":"CAC!X246","v":"00:00:00"},{"$f":"CAC!AB246","v":"00:00:00"},{"$f":"CAC!AC246","v":"00:00:00"},null,null,null,null,"Pendência","Pendência","Pendência","Pendência"]
[{"$f":"CAC!A247","v":0},{"$f":"CAC!C247","v":0},{"$f":"CAC!B247","v":0},-44859,{"$f":"CAC!W247","v":"00:00:00"},{"$f":"CAC!X247","v":"00:00:00"},{"$f":"CAC!AB247","v":"00:00:00"},{"$f":"CAC!AC247","v":"00:00:00"},null,null,null,null,"Pendência","Pendência","Pendência","Pendência"]
[{"$f":"CAC!A248","v":0},{"$f":"CAC!C248","v":0},{"$f":"CAC!B248","v":0},-44859,{"$f":"CAC!W248","v":"00:00:00"},{"$f":"CAC!X248","v":"00:00:00"},{"$f":"CAC!AB248","v":"00:00:00"},{"$f":"CAC!AC248","v":"00:00:00"},null,null,null,null,"Pendência","Pendência","Pendência","Pendência"]
[{"$f":"CAC!A249","v":0},{"$f":"CAC!C249","v":0},{"$f":"CAC!B249","v":0},-44859,{"$f":"CAC!W249","v":"00:00:00"},{"$f":"CAC!X249","v":"00:00:00"},{"$f":"CAC!AB249","v":"00:00:00"},{"$f":"CAC!AC249","v":"00:00:00"},null,null,null,null,"Pendência","Pendência","Pendência","Pendência"]
[{"$f":"CAC!A250","v":0},{"$f":"CAC!C250","v":0},{"$f":"CAC!B250","v":0},-44859,{"$f":"CAC!W250","v":"00:00:00"},{"$f":"CAC!X250","v":"00:00:00"},{"$f":"CAC!AB250","v":"00:00:00"},{"$f":"CAC!AC250","v":"00:00:00"},null,null,null,null,"Pendência","Pendência","Pendência","Pendência"]
[{"$f":"CAC!A251","v":0},{"$f":"CAC!C251","v":0},{"$f":"CAC!B251","v":0},-44859,{"$f":"CAC!W251","v":"00:00:00"},{"$f":"CAC!X251","v":"00:00:00"},{"$f":"CAC!AB251","v":"00:00:00"},{"$f":"CAC!AC251","v":"00:00:00"},null,null,null,null,"Pendência","Pendência","Pendência","Pendência"]
[{"$f":"CAC!A252","v":0},{"$f":"CAC!C252","v":0},{"$f":"CAC!B252","v":0},-44859,{"$f":"CAC!W252","v":"00:00:00"},{"$f":"CAC!X252","v":"00:00:00"},{"$f":"CAC!AB252","v":"00:00:00"},{"$f":"CAC!AC252","v":"00:00:00"},null,null,null,null,"Pendência","Pendência","Pendência","Pendência"]
[{"$f":"CAC!A253","v":0},{"$f":"CAC!C253","v":0},{"$f":"CAC!B253","v":0},-44859,{"$f":"CAC!W253","v":"00:00:00"},{"$f":"CAC!X253","v":"00:00:00"},{"$f":"CAC!AB253","v":"00:00:00"},{"$f":"CAC!AC253","v":"00:00:00"},null,null,null,null,"Pendência","Pendência","Pendência","Pendência"]
[{"$f":"CAC!A254","v":0},{"$f":"CAC!C254","v":0},{"$f":"CAC!B254","v":0},-44859,{"$f":"CAC!W254","v":"00:00:00"},{"$f":"CAC!X254","v":"00:00:00"},{"$f":"CAC!AB254","v":"00:00:00"},{"$f":"CAC!AC254","v":"00:00:00"},null,null,null,null,"Pendência","Pendência","Pendência","Pendência"]
[{"$f":"CAC!A255","v":0},{"$f":"CAC!C255","v":0},{"$f":"CAC!B255","v":0},-44859,{"$f":"CAC!W255","v":"00:00:00"},{"$f":"CAC!X255","v":"00:00:00"},{"$f":"CAC!AB255","v":"00:00:00"},{"$f":"CAC!AC255","v":"00:00:00"},null,null,null,null,"Pendência","Pendência","Pendência","Pendência"]
[{"$f":"CAC!A256","v":0},{"$f":"CAC!C256","v":0},{"$f":"CAC!B256","v":0},-44859,{"$f":"CAC!W256","v":"00:00:00"},{"$f":"CAC!X256","v":"00:00:00"},{"$f":"CAC!AB256","v":"00:00:00"},{"$f":"CAC!AC256","v":"00:00:00"},null,null,null,null,"Pendência","Pendência","Pendência","Pendência"]
[{"$f":"CAC!A257","v":0},{"$f":"CAC!C257","v":0},{"$f":"CAC!B257","v":0},-44859,{"$f":"CAC!W257","v":"00:00:00"},{"$f":"CAC!X257","v":"00:00:00"},{"$f":"CAC!AB257","v":"00:00:00"},{"$f":"CAC!AC257","v":"00:00:00"},null,null,null,null,"Pendência","Pendência","Pendência","Pendência"]
[{"$f":"CAC!A258","v":0},{"$f":"CAC!C258","v":0},{"$f":"CAC!B258","v":0},-44859,{"$f":"CAC!W258","v":"00:00:00"},{"$f":"CAC!X258","v":"00:00:00"},{"$f":"CAC!AB258","v":"00:00:00"},{"$f":"CAC!AC258","v":"00:00:00"},null,null,null,null,"Pendência","Pendência","Pendência","Pendência"]
[{"$f":"CAC!A259","v":0},{"$f":"CAC!C259","v":0},{"$f":"CAC!B259","v":0},-44859,{"$f":"CAC!W259","v":"00:00:00"},{"$f":"CAC!X259","v":"00:00:00"},{"$f":"CAC!AB259","v":"00:00:00"},{"$f":"CAC!AC259","v":"00:00:00"},null,null,null,null,"Pendência","Pendência","Pendência","Pendência"]
[{"$f":"CAC!A260","v":0},{"$f":"CAC!C260","v":0},{"$f":"CAC!B260","v":0},-44859,{"$f":"CAC!W260","v":"00:00:00"},{"$f":"CAC!X260","v":"00:00:00"},{"$f":"CAC!AB260","v":"00:00:00"},{"$f":"CAC!AC260","v":"00:00:00"},null,null,null,null,"Pendência","Pendência","Pendência","Pendência"]
[{"$f":"CAC!A261","v":0},{"$f":"CAC!C261","v":0},{"$f":"CAC!B261","v":0},-44859,{"$f":"CAC!W261","v":"00:00:00"},{"$f":"CAC!X261","v":"00:00:00"},{"$f":"CAC!AB261","v":"00:00:00"},{"$f":"CAC!AC261","v":"00:00:00"},null,null,null,null,"Pendência","Pendência","Pendência","Pendência"]
[{"$f":"CAC!A262","v":0},{"$f":"CAC!C262","v":0},{"$f":"CAC!B262","v":0},-44859,{"$f":"CAC!W262","v":"00:00:00"},{"$f":"CAC!X262","v":"00:00:00"},{"$f":"CAC!AB262","v":"00:00:00"},{"$f":"CAC!AC262","v":"00:00:00"},null,null,null,null,"Pendência","Pendência","Pendência","Pendência"]
[{"$f":"CAC!A263","v":0},{"$f":"CAC!C263","v":0},{"$f":"CAC!B263","v":0},-44859,{"$f":"CAC!W263","v":"00:00:00"},{"$f":"CAC!X263","v":"00:00:00"},{"$f":"CAC!AB263","v":"00:00:00"},{"$f":"CAC!AC263","v":"00:00:00"},null,null,null,null,"Pendência","Pendência","Pendência","Pendência"]
[{"$f":"CAC!A264","v":0},{"$f":"CAC!C264","v":0},{"$f":"CAC!B264","v":0},-44859,{"$f":"CAC!W264","v":"00:00:00"},{"$f":"CAC!X264","v":"00:00:00"},{"$f":"CAC!AB264","v":"00:00:00"},{"$f":"CAC!AC264","v":"00:00:00"},null,null,null,null,"Pendência","Pendência","Pendência","Pendência"]
[{"$f":"CAC!A265","v":0},{"$f":"CAC!C265","v":0},{"$f":"CAC!B265","v":0},-44859,{"$f":"CAC!W265","v":"00:00:00"},{"$f":"CAC!X265","v":"00:00:00"},{"$f":"CAC!AB265","v":"00:00:00"},{"$f":"CAC!AC265","v":"00:00:00"},null,null,null,null,"Pendência","Pendência","Pendência","Pendência"]
[{"$f":"CAC!A266","v":0},{"$f":"CAC!C266","v":0},{"$f":"CAC!B266","v":0},-44859,{"$f":"CAC!W266","v":"00:00:00"},{"$f":"CAC!X266","v":"00:00:00"},{"$f":"CAC!AB266","v":"00:00:00"},{"$f":"CAC!AC266","v":"00:00:00"},null,null,null,null,"Pendência","Pendência","Pendência","Pendência"]
[{"$f":"CAC!A267","v":0},{"$f":"CAC!C267","v":0},{"$f":"CAC!B267","v":0},-44859,{"$f":"CAC!W267","v":"00:00:00"},{"$f":"CAC!X267","v":"00:00:00"},{"$f":"CAC!AB267","v":"00:00:00"},{"$f":"CAC!AC267","v":"00:00:00"},null,null,null,null,"Pendência","Pendência","Pendência","Pendência"]
[{"$f":"CAC!A268","v":0},{"$f":"CAC!C268","v":0},{"$f":"CAC!B268","v":0},-44859,{"$f":"CAC!W268","v":"00:00:00"},{"$f":"CAC!X268","v":"00:00:00"},{"$f":"CAC!AB268","v":"00:00:00"},{"$f":"CAC!AC268","v":"00:00:00"},null,null,null,null,"Pendência","Pendência","Pendência","Pendência"]
[{"$f":"CAC!A269","v":0},{"$f":"CAC!C269","v":0},{"$f":"CAC!B269","v":0},-44859,{"$f":"CAC!W269","v":"00:00:00"},{"$f":"CAC!X269","v":"00:00:00"},{"$f":"CAC!AB269","v":"00:00:00"},{"$f":"CAC!AC269","v":"00:00:00"},null,null,null,null,"Pendência","Pendência","Pendência","Pendência"]
[{"$f":"CAC!A270","v":0},{"$f":"CAC!C270","v":0},{"$f":"CAC!B270","v":0},-44859,{"$f":"CAC!W270","v":"00:00:00"},{"$f":"CAC!X270","v":"00:00:00"},{"$f":"CAC!AB270","v":"00:00:00"},{"$f":"CAC!AC270","v":"00:00:00"},null,null,null,null,"Pendência","Pendência","Pendência","Pendência"]
[{"$f":"CAC!A271","v":0},{"$f":"CAC!C271","v":0},{"$f":"CAC!B271","v":0},-44859,{"$f":"CAC!W271","v":"00:00:00"},{"$f":"CAC!X271","v":"00:00:00"},{"$f":"CAC!AB271","v":"00:00:00"},{"$f":"CAC!AC271","v":"00:00:00"},null,null,null,null,"Pendência","Pendência","Pendência","Pendência"]
[{"$f":"CAC!A272","v":0},{"$f":"CAC!C272","v":0},{"$f":"CAC!B272","v":0},-44859,{"$f":"CAC!W272","v":"00:00:00"},{"$f":"CAC!X272","v":"00:00:00"},{"$f":"CAC!AB272","v":"00:00:00"},{"$f":"CAC!AC272","v":"00:00:00"},null,null,null,null,"Pendência","Pendência","Pendência","Pendência"]
[{"$f":"CAC!A273","v":0},{"$f":"CAC!C273","v":0},{"$f":"CAC!B273","v":0},-44859,{"$f":"CAC!W273","v":"00:00:00"},{"$f":"CAC!X273","v":"00:00:00"},{"$f":"CAC!AB273","v":"00:00:00"},{"$f":"CAC!AC273","v":"00:00:00"},null,null,null,null,"Pendência","Pendência","Pendência","Pendência"]
[{"$f":"CAC!A274","v":0},{"$f":"CAC!C274","v":0},{"$f":"CAC!B274","v":0},-44859,{"$f":"CAC!W274","v":"00:00:00"},{"$f":"CAC!X274","v":"00:00:00"},{"$f":"CAC!AB274","v":"00:00:00"},{"$f":"CAC!AC274","v":"00:00:00"},null,null,null,null,"Pendência","Pendência","Pendência","Pendência"]
[{"$f":"CAC!A241","v":0},{"$f":"CAC!C241","v":0},{"$f":"CAC!B241","v":0},{"$f":"H244-TODAY()","v":-44859},{"$f":"CAC!W241","v":"00:00:00"},{"$f":"CAC!X241","v":"00:00:00"},{"$f":"CAC!AB275","v":"00:00:00"},{"$f":"CAC!AC241","v":"00:00:00"},null,null,null,null,"Pendência","Pendência","Pendência","Pendência"]
[{"$f":"CAC!A242","v":0},{"$f":"CAC!C242","v":0},{"$f":"CAC!B242","v":0},-44859,{"$f":"CAC!W242","v":"00:00:00"},{"$f":"CAC!X242","v":"00:00:00"},{"$f":"CAC!AB276","v":"00:00:00"},{"$f":"CAC!AC242","v":"00:00:00"},null,null,null,null,"Pendência","Pendência","Pendência","Pendência"]
[{"$f":"CAC!A243","v":0},{"$f":"CAC!C243","v":0},{"$f":"CAC!B243","v":0},-44859,{"$f":"CAC!W243","v":"00:00:00"},{"$f":"CAC!X243","v":"00:00:00"},{"$f":"CAC!AB277","v":"00:00:00"},{"$f":"CAC!AC243","v":"00:00:00"},null,null,null,null,"Pendência","Pendência","Pendência","Pendência"]
[{"$f":"CAC!A244","v":0},{"$f":"CAC!C244","v":0},{"$f":"CAC!B244","v":0},-44859,{"$f":"CAC!W244","v":"00:00:00"},{"$f":"CAC!X244","v":"00:00:00"},{"$f":"CAC!AB278","v":"00:00:00"},{"$f":"CAC!AC244","v":"00:00:00"},null,null,null,null,"Pendência","Pendência","Pendência","Pendência"]
[{"$f":"CAC!A245","v":0},{"$f":"CAC!C245","v":0},{"$f":"CAC!B245","v":0},-44859,{"$f":"CAC!W245","v":"00:00:00"},{"$f":"CAC!X245","v":"00:00:00"},{"$f":"CAC!AB279","v":"00:00:00"},{"$f":"CAC!AC245","v":"00:00:00"},null,null,null,null,"Pendência","Pendência","Pendência","Pendência"]
[{"$f":"CAC!A246","v":0},{"$f":"CAC!C246","v":0},{"$f":"CAC!B246","v":0},-44859,{"$f":"CAC!W246","v":"00:00:00"},{"$f":"CAC!X246","v":"00:00:00"},{"$f":"CAC!AB280","v":"00:00:00"},{"$f":"CAC!AC246","v":"00:00:00"},null,null,null,null,"Pendência","Pendência","Pendência","Pendência"]
[{"$f":"CAC!A247","v":0},{"$f":"CAC!C247","v":0},{"$f":"CAC!B247","v":0},-44859,{"$f":"CAC!W247","v":"00:00:00"},{"$f":"CAC!X247","v":"00:00:00"},{"$f":"CAC!AB281","v":"00:00:00"},{"$f":"CAC!AC247","v":"00:00:00"},null,null,null,null,"Pendência","Pendência","Pendência","Pendência"]
[{"$f":"CAC!A248","v":0},{"$f":"CAC!C248","v":0},{"$f":"CAC!B248","v":0},-44859,{"$f":"CAC!W248","v":"00:00:00"},{"$f":"CAC!X248","v":"00:00:00"},{"$f":"CAC!AB282","v":"00:00:00"},{"$f":"CAC!AC248","v":"00:00:00"},null,null,null,null,"Pendência","Pendência","Pendência","Pendência"]
[{"$f":"CAC!A249","v":0},{"$f":"CAC!C249","v":0},{"$f":"CAC!B249","v":0},-44859,{"$f":"CAC!W249","v":"00:00:00"},{"$f":"CAC!X249","v":"00:00:00"},{"$f":"CAC!AB283","v":"00:00:00"},{"$f":"CAC!AC249","v":"00:00:00"},null,null,null,null,"Pendência","Pendência","Pendência","Pendência"]
[{"$f":"CAC!A250","v":0},{"$f":"CAC!C250","v":0},{"$f":"CAC!B250","v":0},-44859,{"$f":"CAC!W250","v":"00:00:00"},{"$f":"CAC!X250","v":"00:00:00"},{"$f":"CAC!AB284","v":"00:00:00"},{"$f":"CAC!AC250","v":"00:00:00"},null,null,null,null,"Pendência","Pendência","Pendência","Pendência"]
[{"$f":"CAC!A251","v":0},{"$f":"CAC!C251","v":0},{"$f":"CAC!B251","v":0},-44859,{"$f":"CAC!W251","v":"00:00:00"},{"$f":"CAC!X251","v":"00:00:00"},{"$f":"CAC!AB285","v":"00:00:00"},{"$f":"CAC!AC251","v":"00:00:00"},null,null,null,null,"Pendência","Pendência","Pendência","Pendência"]
[{"$f":"CAC!A252","v":0},{"$f":"CAC!C252","v":0},{"$f":"CAC!B252","v":0},-44859,{"$f":"CAC!W252","v":"00:00:00"},{"$f":"CAC!X252","v":"00:00:00"},{"$f":"CAC!AB286","v":"00:00:00"},{"$f":"CAC!AC252","v":"00:00:00"},null,null,null,null,"Pendência","Pendência","Pendência","Pendência"]
[{"$f":"CAC!A253","v":0},{"$f":"CAC!C253","v":0},{"$f":"CAC!B253","v":0},-44859,{"$f":"CAC!W253","v":"00:00:00"},{"$f":"CAC!X253","v":"00:00:00"},{"$f":"CAC!AB287","v":"00:00:00"},{"$f":"CAC!AC253","v":"00:00:00"},null,null,null,null,"Pendência","Pendência","Pendência","Pendência"]
[{"$f":"CAC!A254","v":0},{"$f":"CAC!C254","v":0},{"$f":"CAC!B254","v":0},-44859,{"$f":"CAC!W254","v":"00:00:00"},{"$f":"CAC!X254","v":"00:00:00"},{"$f":"CAC!AB288","v":"00:00:00"},{"$f":"CAC!AC254","v":"00:00:00"},null,null,null,null,"Pendência","Pendência","Pendência","Pendência"]
[{"$f":"CAC!A255","v":0},{"$f":"CAC!C255","v":0},{"$f":"CAC!B255","v":0},-44859,{"$f":"CAC!W255","v":"00:00:00"},{"$f":"CAC!X255","v":"00:00:00"},{"$f":"CAC!AB289","v":"00:00:00"},{"$f":"CAC!AC255","v":"00:00:00"},null,null,null,null,"Pendência","Pendência","Pendência","Pendência"]
[{"$f":"CAC!A256","v":0},{"$f":"CAC!C256","v":0},{"$f":"CAC!B256","v":0},-44859,{"$f":"CAC!W256","v":"00:00:00"},{"$f":"CAC!X256","v":"00:00:00"},{"$f":"CAC!AB290","v":"00:00:00"},{"$f":"CAC!AC256","v":"00:00:00"},null,null,null,null,{"$f":"IF(E259=\"---\",\"N/A\",IF(AND(I259=\"\",NOW()-E259<0),\"Em dia\",IF(AND(I259=\"\",NOW()-E259>0),\"Pendência\",IF(I259>E259,\"Entregue com atraso\",\"Entregue\"))))","v":"Pendência"},{"$f":"IF(F259=\"---\",\"N/A\",IF(AND(J259=\"\",NOW()-F259<0),\"Em dia\",IF(AND(J259=\"\",NOW()-F259>0),\"Pendência\",IF(J259>F259,\"Entregue com atraso\",\"Entregue\"))))","v":"Pendência"},{"$f":"IF(G259=\"---\",\"N/A\",IF(AND(K259=\"\",NOW()-G259<0),\"Em dia\",IF(AND(K259=\"\",NOW()-G259>0),\"Pendência\",IF(K259>G259,\"Contratado com atraso\",\"Contratado\"))))","v":"Pendência"},{"$f":"IF(AND(L259=\"\",NOW()-H259<0),\"Em dia\",IF(AND(L259=\"\",NOW()-H259>0),\"Pendência\",IF(L259>H259,\"Contratado com atraso\",\"Contratado\")))","v":"Pendência"}]
[{"$f":"CAC!A257","v":0},{"$f":"CAC!C257","v":0},{"$f":"CAC!B257","v":0},-44859,{"$f":"CAC!W257","v":"00:00:00"},{"$f":"CAC!X257","v":"00:00:00"},{"$f":"CAC!AB291","v":"00:00:00"},{"$f":"CAC!AC257","v":"00:00:00"},null,null,null,null,"Pendência","Pendência","Pendência","Pendência"]
[{"$f":"CAC!A258","v":0},{"$f":"CAC!C258","v":0},{"$f":"CAC!B258","v":0},-44859,{"$f":"CAC!W258","v":"00:00:00"},{"$f":"CAC!X258","v":"00:00:00"},{"$f":"CAC!AB292","v":"00:00:00"},{"$f":"CAC!AC258","v":"00:00:00"},null,null,null,null,"Pendência","Pendência","Pendência","Pendência"]
[{"$f":"CAC!A259","v":0},{"$f":"CAC!C259","v":0},{"$f":"CAC!B259","v":0},-44859,{"$f":"CAC!W259","v":"00:00:00"},{"$f":"CAC!X259","v":"00:00:00"},{"$f":"CAC!AB293","v":"00:00:00"},{"$f":"CAC!AC259","v":"00:00:00"},null,null,null,null,"Pendência","Pendência","Pendência","Pendência"]
[{"$f":"CAC!A260","v":0},{"$f":"CAC!C260","v":0},{"$f":"CAC!B260","v":0},-44859,{"$f":"CAC!W260","v":"00:00:00"},{"$f":"CAC!X260","v":"00:00:00"},{"$f":"CAC!AB294","v":"00:00:00"},{"$f":"CAC!AC260","v":"00:00:00"},null,null,null,null,"Pendência","Pendência","Pendência","Pendência"]
[{"$f":"CAC!A261","v":0},{"$f":"CAC!C261","v":0},{"$f":"CAC!B261","v":0},-44859,{"$f":"CAC!W261","v":"00:00:00"},{"$f":"CAC!X261","v":"00:00:00"},{"$f":"CAC!AB295","v":"00:00:00"},{"$f":"CAC!AC261","v":"00:00:00"},null,null,null,null,"Pendência","Pendência","Pendência","Pendência"]
[{"$f":"CAC!A262","v":0},{"$f":"CAC!C262","v":0},{"$f":"CAC!B262","v":0},-44859,{"$f":"CAC!W262","v":"00:00:00"},{"$f":"CAC!X262","v":"00:00:00"},{"$f":"CAC!AB296","v":"00:00:00"},{"$f":"CAC!AC262","v":"00:00:00"},null,null,null,null,"Pendência","Pendência","Pendência","Pendência"]
[{"$f":"CAC!A263","v":0},{"$f":"CAC!C263","v":0},{"$f":"CAC!B263","v":0},-44859,{"$f":"CAC!W263","v":"00:00:00"},{"$f":"CAC!X263","v":"00:00:00"},{"$f":"CAC!AB297","v":"00:00:00"},{"$f":"CAC!AC263","v":"00:00:00"},null,null,null,null,"Pendência","Pendência","Pendência","Pendência"]
[{"$f":"CAC!A264","v":0},{"$f":"CAC!C264","v":0},{"$f":"CAC!B264","v":0},-44859,{"$f":"CAC!W264","v":"00:00:00"},{"$f":"CAC!X264","v":"00:00:00"},{"$f":"CAC!AB298","v":"00:00:00"},{"$f":"CAC!AC264","v":"00:00:00"},null,null,null,null,"Pendência","Pendência","Pendência","Pendência"]
[{"$f":"CAC!A265","v":0},{"$f":"CAC!C265","v":0},{"$f":"CAC!B265","v":0},-44859,{"$f":"CAC!W265","v":"00:00:00"},{"$f":"CAC!X265","v":"00:00:00"},{"$f":"CAC!AB299","v":"00:00:00"},{"$f":"CAC!AC265","v":"00:00:00"},null,null,null,null,"Pendência","Pendência","Pendência","Pendência"]
[{"$f":"CAC!A266","v":0},{"$f":"CAC!C266","v":0},{"$f":"CAC!B266","v":0},-44859,{"$f":"CAC!W266","v":"00:00:00"},{"$f":"CAC!X266","v":"00:00:00"},{"$f":"CAC!AB300","v":"00:00:00"},{"$f":"CAC!AC266","v":"00:00:00"},null,null,null,null,"Pendência","Pendência","Pendência","Pendência"]
[{"$f":"CAC!A267","v":0},{"$f":"CAC!C267","v":0},{"$f":"CAC!B267","v":0},-44859,{"$f":"CAC!W267","v":"00:00:00"},{"$f":"CAC!X267","v":"00:00:00"},{"$f":"CAC!AB301","v":"00:00:00"},{"$f":"CAC!AC267","v":"00:00:00"},null,null,null,null,"Pendência","Pendência","Pendência","Pendência"]
[{"$f":"CAC!A268","v":0},{"$f":"CAC!C268","v":0},{"$f":"CAC!B268","v":0},-44859,{"$f":"CAC!W268","v":"00:00:00"},{"$f":"CAC!X268","v":"00:00:00"},{"$f":"CAC!AB302","v":"00:00:00"},{"$f":"CAC!AC268","v":"00:00:00"},null,null,null,null,"Pendência","Pendência","Pendência","Pendência"]
[{"$f":"CAC!A269","v":0},{"$f":"CAC!C269","v":0},{"$f":"CAC!B269","v":0},-44859,{"$f":"CAC!W269","v":"00:00:00"},{"$f":"CAC!X269","v":"00:00:00"},{"$f":"CAC!AB303","v":"00:00:00"},{"$f":"CAC!AC269","v":"00:00:00"},null,null,null,null,"Pendência","Pendência","Pendência","Pendência"]
[{"$f":"CAC!A270","v":0},{"$f":"CAC!C270","v":0},{"$f":"CAC!B270","v":0},-44859,{"$f":"CAC!W270","v":"00:00:00"},{"$f":"CAC!X270","v":"00:00:00"},{"$f":"CAC!AB304","v":"00:00:00"},{"$f":"CAC!AC270","v":"00:00:00"},null,null,null,null,"Pendência","Pendência","Pendência","Pendência"]
[{"$f":"CAC!A271","v":0},{"$f":"CAC!C271","v":0},{"$f":"CAC!B271","v":0},-44859,{"$f":"CAC!W271","v":"00:00:00"},{"$f":"CAC!X271","v":"00:00:00"},{"$f":"CAC!AB305","v":"00:00:00"},{"$f":"CAC!AC271","v":"00:00:00"},null,null,null,null,"Pendência","Pendência","Pendência","Pendência"]
[{"$f":"CAC!A272","v":0},{"$f":"CAC!C272","v":0},{"$f":"CAC!B272","v":0},-44859,{"$f":"CAC!W272","v":"00:00:00"},{"$f":"CAC!X272","v":"00:00:00"},{"$f":"CAC!AB306","v":"00:00:00"},{"$f":"CAC!AC272","v":"00:00:00"},null,null,null,null,"Pendência","Pendência","Pendência","Pendência"]
[{"$f":"CAC!A273","v":0},{"$f":"CAC!C273","v":0},{"$f":"CAC!B273","v":0},-44859,{"$f":"CAC!W273","v":"00:00:00"},{"$f":"CAC!X273","v":"00:00:00"},{"$f":"CAC!AB307","v":"00:00:00"},{"$f":"CAC!AC273","v":"00:00:00"},null,null,null,null,"Pendência","Pendência","Pendência","Pendência"]
[{"$f":"CAC!A274","v":0},{"$f":"CAC!C274","v":0},{"$f":"CAC!B274","v":0},-44859,{"$f":"CAC!W274","v":"00:00:00"},{"$f":"CAC!X274","v":"00:00:00"},{"$f":"CAC!AB308","v":"00:00:00"},{"$f":"CAC!AC274","v":"00:00:00"},null,null,null,null,"Pendência","Pendência","Pendência","Pendência"]
[{"$f":"CAC!A275","v":0},{"$f":"CAC!C275","v":0},{"$f":"CAC!B275","v":0},-44859,{"$f":"CAC!W275","v":"00:00:00"},{"$f":"CAC!X275","v":"00:00:00"},{"$f":"CAC!AB309","v":"00:00:00"},{"$f":"CAC!AC275","v":"00:00:00"},null,null,null,null,"Pendência","Pendência","Pendência","Pendência"]
[{"$f":"CAC!A276","v":0},{"$f":"CAC!C276","v":0},{"$f":"CAC!B276","v":0},-44859,{"$f":"CAC!W276","v":"00:00:00"},{"$f":"CAC!X276","v":"00:00:00"},{"$f":"CAC!AB310","v":"00:00:00"},{"$f":"CAC!AC276","v":"00:00:00"},null,null,null,null,"Pendência","Pendência","Pendência","Pendência"]
[{"$f":"CAC!A277","v":0},{"$f":"CAC!C277","v":0},{"$f":"CAC!B277","v":0},-44859,{"$f":"CAC!W277","v":"00:00:00"},{"$f":"CAC!X277","v":"00:00:00"},{"$f":"CAC!AB311","v":"00:00:00"},{"$f":"CAC!AC277","v":"00:00:00"},null,null,null,null,"Pendência","Pendência","Pendência","Pendência"]
[{"$f":"CAC!A278","v":0},{"$f":"CAC!C278","v":0},{"$f":"CAC!B278","v":0},-44859,{"$f":"CAC!W278","v":"00:00:00"},{"$f":"CAC!X278","v":"00:00:00"},{"$f":"CAC!AB312","v":"00:00:00"},{"$f":"CAC!AC278","v":"00:00:00"},null,null,null,null,"Pendência","Pendência","Pendência","Pendência"]
[{"$f":"CAC!A279","v":0},{"$f":"CAC!C279","v":0},{"$f":"CAC!B279","v":0},-44859,{"$f":"CAC!W279","v":"00:00:00"},{"$f":"CAC!X279","v":"00:00:00"},{"$f":"CAC!AB313","v":"00:00:00"},{"$f":"CAC!AC279","v":"00:00:00"},null,null,null,null,"Pendência","Pendência","Pendência","Pendência"]
[{"$f":"CAC!A280","v":0},{"$f":"CAC!C280","v":0},{"$f":"CAC!B280","v":0},{"$f":"H283-TODAY()","v":-44859},{"$f":"CAC!W280","v":"00:00:00"},{"$f":"CAC!X280","v":"00:00:00"},{"$f":"CAC!AB314","v":"00:00:00"},{"$f":"CAC!AC280","v":"00:00:00"},null,null,null,null,"Pendência","Pendência","Pendência","Pendência"]
[{"$f":"CAC!A281","v":0},{"$f":"CAC!C281","v":0},{"$f":"CAC!B281","v":0},-44859,{"$f":"CAC!W281","v":"00:00:00"},{"$f":"CAC!X281","v":"00:00:00"},{"$f":"CAC!AB315","v":"00:00:00"},{"$f":"CAC!AC281","v":"00:00:00"},null,null,null,null,"Pendência","Pendência","Pendência","Pendência"]
[{"$f":"CAC!A282","v":0},{"$f":"CAC!C282","v":0},{"$f":"CAC!B282","v":0},-44859,{"$f":"CAC!W282","v":"00:00:00"},{"$f":"CAC!X282","v":"00:00:00"},{"$f":"CAC!AB316","v":"00:00:00"},{"$f":"CAC!AC282","v":"00:00:00"},null,null,null,null,"Pendência","Pendência","Pendência","Pendência"]
[{"$f":"CAC!A283","v":0},{"$f":"CAC!C283","v":0},{"$f":"CAC!B283","v":0},-44859,{"$f":"CAC!W283","v":"00:00:00"},{"$f":"CAC!X283","v":"00:00:00"},{"$f":"CAC!AB317","v":"00:00:00"},{"$f":"CAC!AC283","v":"00:00:00"},null,null,null,null,"Pendência","Pendência","Pendência","Pendência"]
[{"$f":"CAC!A284","v":0},{"$f":"CAC!C284","v":0},{"$f":"CAC!B284","v":0},-44859,{"$f":"CAC!W284","v":"00:00:00"},{"$f":"CAC!X284","v":"00:00:00"},{"$f":"CAC!AB318","v":"00:00:00"},{"$f":"CAC!AC284","v":"00:00:00"},null,null,null,null,"Pendência","Pendência","Pendência","Pendência"]
[{"$f":"CAC!A285","v":0},{"$f":"CAC!C285","v":0},{"$f":"CAC!B285","v":0},-44859,{"$f":"CAC!W285","v":"00:00:00"},{"$f":"CAC!X285","v":"00:00:00"},{"$f":"CAC!AB319","v":"00:00:00"},{"$f":"CAC!AC285","v":"00:00:00"},null,null,null,null,"Pendência","Pendência","Pendência","Pendência"]
[{"$f":"CAC!A286","v":0},{"$f":"CAC!C286","v":0},{"$f":"CAC!B286","v":0},-44859,{"$f":"CAC!W286","v":"00:00:00"},{"$f":"CAC!X286","v":"00:00:00"},{"$f":"CAC!AB320","v":"00:00:00"},{"$f":"CAC!AC286","v":"00:00:00"},null,null,null,null,"Pendência","Pendência","Pendência","Pendência"]
[{"$f":"CAC!A287","v":0},{"$f":"CAC!C287","v":0},{"$f":"CAC!B287","v":0},-44859,{"$f":"CAC!W287","v":"00:00:00"},{"$f":"CAC!X287","v":"00:00:00"},{"$f":"CAC!AB321","v":"00:00:00"},{"$f":"CAC!AC287","v":"00:00:00"},null,null,null,null,"Pendência","Pendência","Pendência","Pendência"]
[{"$f":"CAC!A288","v":0},{"$f":"CAC!C288","v":0},{"$f":"CAC!B288","v":0},-44859,{"$f":"CAC!W288","v":"00:00:00"},{"$f":"CAC!X288","v":"00:00:00"},{"$f":"CAC!AB322","v":"00:00:00"},{"$f":"CAC!AC288","v":"00:00:00"},null,null,null,null,"Pendência","Pendência","Pendência","Pendência"]
[{"$f":"CAC!A289","v":0},{"$f":"CAC!C289","v":0},{"$f":"CAC!B289","v":0},-44859,{"$f":"CAC!W289","v":"00:00:00"},{"$f":"CAC!X289","v":"00:00:00"},{"$f":"CAC!AB323","v":"00:00:00"},{"$f":"CAC!AC289","v":"00:00:00"},null,null,null,null,"Pendência","Pendência","Pendência","Pendência"]
[{"$f":"CAC!A290","v":0},{"$f":"CAC!C290","v":0},{"$f":"CAC!B290","v":0},-44859,{"$f":"CAC!W290","v":"00:00:00"},{"$f":"CAC!X290","v":"00:00:00"},{"$f":"CAC!AB324","v":"00:00:00"},{"$f":"CAC!AC290","v":"00:00:00"},null,null,null,null,"Pendência","Pendência","Pendência","Pendência"]
[{"$f":"CAC!A291","v":0},{"$f":"CAC!C291","v":0},{"$f":"CAC!B291","v":0},-44859,{"$f":"CAC!W291","v":"00:00:00"},{"$f":"CAC!X291","v":"00:00:00"},{"$f":"CAC!AB325","v":"00:00:00"},{"$f":"CAC!AC291","v":"00:00:00"},null,null,null,null,"Pendência","Pendência","Pendência","Pendência"]
[{"$f":"CAC!A292","v":0},{"$f":"CAC!C292","v":0},{"$f":"CAC!B292","v":0},-44859,{"$f":"CAC!W292","v":"00:00:00"},{"$f":"CAC!X292","v":"00:00:00"},{"$f":"CAC!AB326","v":"00:00:00"},{"$f":"CAC!AC292","v":"00:00:00"},null,null,null,null,"Pendência","Pendência","Pendência","Pendência"]
[{"$f":"CAC!A293","v":0},{"$f":"CAC!C293","v":0},{"$f":"CAC!B293","v":0},-44859,{"$f":"CAC!W293","v":"00:00:00"},{"$f":"CAC!X293","v":"00:00:00"},{"$f":"CAC!AB327","v":"00:00:00"},{"$f":"CAC!AC293","v":"00:00:00"},null,null,null,null,"Pendência","Pendência","Pendência","Pendência"]
[{"$f":"CAC!A294","v":0},{"$f":"CAC!C294","v":0},{"$f":"CAC!B294","v":0},-44859,{"$f":"CAC!W294","v":"00:00:00"},{"$f":"CAC!X294","v":"00:00:00"},{"$f":"CAC!AB328","v":"00:00:00"},{"$f":"CAC!AC294","v":"00:00:00"},null,null,null,null,"Pendência","Pendência","Pendência","Pendência"]
[{"$f":"CAC!A295","v":0},{"$f":"CAC!C295","v":0},{"$f":"CAC!B295","v":0},-44859,{"$f":"CAC!W295","v":"00:00:00"},{"$f":"CAC!X295","v":"00:00:00"},{"$f":"CAC!AB329","v":"00:00:00"},{"$f":"CAC!AC295","v":"00:00:00"},null,null,null,null,"Pendência","Pendência","Pendência","Pendência"]
[{"$f":"CAC!A296","v":0},{"$f":"CAC!C296","v":0},{"$f":"CAC!B296","v":0},-44859,{"$f":"CAC!W296","v":"00:00:00"},{"$f":"CAC!X296","v":"00:00:00"},{"$f":"CAC!AB330","v":"00:00:00"},{"$f":"CAC!AC296","v":"00:00:00"},null,null,null,null,"Pendência","Pendência","Pendência","Pendência"]
[{"$f":"CAC!A297","v":0},{"$f":"CAC!C297","v":0},{"$f":"CAC!B297","v":0},-44859,{"$f":"CAC!W297","v":"00:00:00"},{"$f":"CAC!X297","v":"00:00:00"},{"$f":"CAC!AB331","v":"00:00:00"},{"$f":"CAC!AC297","v":"00:00:00"},null,null,null,null,"Pendência","Pendência","Pendência","Pendência"]

{"sheet":"Orientações - uso das planilhas","index":4,"n_rows":14,"n_cols":2,"rows_kept":14,"cut":false,"hidden":false,"merged":[[9,1,9,12],[10,1,10,12],[1,1,1,12],[13,1,13,12],[2,0,3,0],[2,1,2,12],[3,1,3,12],[4,1,4,12],[5,1,5,12],[6,1,6,12]]}
["Planilha PAC"]
["Preenchimento de dados:","Todas as colunas deverão ser preenchidas pelo usuário;"]
["DOD com mais de 1 item:","O ID deverá ser mencionado em cada linha correspondente a cada item, para permitir adequada utilização da ferramenta de filtro;"]
[null,"Quando houver mais de um item por DOD, deverá ser informado um item por linha, para permitir adequada visualização e contabilização de dados nas planilhas PAC e CAC;"]
["Coluna A:","Quando o ID tiver de ser mencionado em mais de uma linha (DODs com mais de 1 item), não mesclar as respectivas células de modo a permitir a adequada utilização da ferramenta de filtro;"]
["Colunas E, F, G, H, I, J, K, L, M:","Em DODs com mais de 1 item, informar um item para cada linha. Não mesclar as respectivas células de modo a permitir a adequada visualização e contabilização de dados nas planilhas PAC e CAC;"]
["Coluna W (após coluna V - Riscos da não contratação):","Informar o algarismo \"1\" para cada linha que houver item informado. Isso é necessário para contabilizar corretamente a quantidade de itens na planilha CAC, coluna J - \"Qtd de Itens do Objeto\";"]
[]
["Planilha CAC"]
["Preenchimento de dados:","Somente as colunas em branco (A, C, H e I) deverão ser preenchidas pelo usuário, seguindo-se as recomendações de resposta indicadas em vermelho no cabeçalho;"]
["Coluna A:","Na transcrição dos IDs do PAC para essa planilha, cuidar para:\na) não repetir os IDs (ainda que na planilha PAC eles tenham se repetido por conta de DODs com mais de 1 item);\nb) transcrever os IDs exatamente como foram informados na planilha PAC;"]
[]
["Planilha CAC - Acompanhamento"]
["Preenchimento de dados:","Somente as colunas em branco (I, J, K e L) deverão ser preenchidas pelo usuário, de acordo com a data de efetiva entrega dos artefatos (ou do início dos procedimentos no caso de renovação/prorrogação) e da efetiva contratação."]

{"sheet":"Tabela temporalidade","index":5,"n_rows":26,"n_cols":9,"rows_kept":26,"cut":false,"hidden":false,"merged":[[25,1,25,6],[24,1,24,6],[23,1,23,6],[22,1,22,6],[21,1,21,6],[20,1,20,6],[19,1,19,6],[1,1,1,2],[0,0,0,3],[0,5,0,8],[1,6,1,7]]}
["LICITAÇÃO",null,null,null,null,"DISPENSA E INEXIGIBILIDADE"]
["Etapa","Definidores do Tempo",null,"Tempo (dias)",null,"Etapa","Definidores do Tempo",null,"Tempo (dias)"]
["TApETP","---","---",15,null,"TApETP","---","---",15]
["TElabTR","---","---",10,null,"TElabTR","---","---",10]
["TApTR","sem contrato","1 item",20,null,"TFICD","com ou sem contrato","1 a 10 itens",35]
["TApTR","sem contrato","2 a 5 itens",30,null,"TFICD","com ou sem contrato","11 a 20 itens",45]
["TApTR","sem contrato","6 a 15 itens",45,null,"TFICD","com ou sem contrato","21 ou + itens",60]
["TApTR","sem contrato","16 ou + itens",70,null,"Instrução processual","---","---",3]
["TApTR","com contrato","1 item",40,null,"Autorização da contratação","---","---",3]
["TApTR","com contrato","2 a 5 itens",50,null,"TElabCont/NE","emissão de nota de empenho","---",5]
["TApTR","com contrato","6 a 15 itens",75]
["TApTR","com contrato","16 ou + itens",100]
["TFILi","sem contrato","qq nº itens",15,null,null,"verificar correspondencia de cores entre uma tabela e outra"]
["TFILi","com contrato","qq nº itens",25]
["TFELi","sem amostra","qq nº itens",25]
["TFELi","com amostra","qq nº itens",40]
["TElabCont/NE","assinatura de contrato","---",5]
[]
["Legenda:"]
["TApETP","Aperfeiçoamento do Estudo Técnico Preliminar – TApETP: da data de entrega do ETP à data de sua aprovação"]
["TElabTR","Tempo de elaboração do Termo de Referência – TElabTR: da data de aprovação do ETP à data de entrega do TR"]
["TApTR","Aperfeiçoamento do Termo de Referência – TApTR: da data de entrega do TR à data de sua aprovação"]
["TFILi","Fase Interna da Licitação – TFIL: da data de aprovação do TR à data de publicação do edital"]
["TFELi","Fase Externa da Licitação – TFEL: da data de publicação do edital à data de homologação do resultado da licitação"]
["TElabCont/NE","Tempo de elaboração e assinatura do contrato ou de emissão de nota de empenho"]
["TFICD","Fase Interna da Contratação Direta: compreende aperfeiçoamento do TR, pesquisa de preços, elaboração do mapa de preços, consulta à documentação necessária para contratar, pré-instrução processual (aprovação do DOD, ETP e TR e verificação da disponibilidade orçamentária), elaboração de minuta de contrato e análise da minuta."]

{"sheet":"Resumo_DADOS","index":6,"n_rows":36,"n_cols":4,"rows_kept":36,"cut":false,"hidden":false,"merged":[]}
[]
[null,"Unidade","Demandas","Estimado"]
[null,"SESEG",{"$f":"COUNTIF(CAC!$A$6:$A$47,\"SESEG*\")","v":18},{"$f":"SUMIF(CAC!$A$6:$A$53,B3&\"*\",CAC!$F$6:$F$53)","v":1765174.9200000002}]
[null,"SEMAP",{"$f":"COUNTIF(CAC!$A$6:$A$47,\"SEMAP*\")","v":1},{"$f":"SUMIF(CAC!$A$6:$A$53,B4&\"*\",CAC!$F$6:$F$53)","v":52505}]
[null,"SEVIT",{"$f":"COUNTIF(CAC!$A$6:$A$47,\"sevit*\")","v":11},{"$f":"SUMIF(CAC!$A$6:$A$53,B5&\"*\",CAC!$F$6:$F$53)","v":348814.36}]
[null,"SEINF",{"$f":"COUNTIF(CAC!$A$6:$A$47,\"seinf*\")","v":1},{"$f":"SUMIF(CAC!$A$6:$A$53,B6&\"*\",CAC!$F$6:$F$53)","v":472680}]
[null,"SEBES",{"$f":"COUNTIF(CAC!$A$6:$A$47,\"sebes*\")","v":4},{"$f":"SUMIF(CAC!$A$6:$A$53,B7&\"*\",CAC!$F$6:$F$53)","v":343720.14999999997}]
[null,"SECAM",{"$f":"COUNTIF(CAC!$A$6:$A$47,\"SECAM*\")","v":5},{"$f":"SUMIF(CAC!$A$6:$A$53,B8&\"*\",CAC!$F$6:$F$53)","v":91457.88}]
[null,"SELIT",{"$f":"COUNTIF(CAC!$A$6:$A$47,\"SELIT*\")","v":2},{"$f":"SUMIF(CAC!$A$6:$A$53,B9&\"*\",CAC!$F$6:$F$53)","v":110865}]
[null,"SEDER",{"$f":"COUNTIF(CAC!$A$6:$A$50,\"SEDER*\")","v":1},{"$f":"SUMIF(CAC!$A$6:$A$53,B10&\"*\",CAC!$F$6:$F$53)","v":60000}]
[]
[null,"Total",{"$f":"SUM(C3:C11)","v":43},{"$f":"SUM(D3:D11)","v":3245217.31}]
[]
[]
[]
[]
[]
[]
[]
[]
[]
[]
[]
[]
[null,"Modalidade","Qtde","Estimado"]
[null,"Licitação",{"$f":"COUNTIF(CAC!$G$6:$G$50,\"Licitação\")","v":15},{"$f":"SUMIF(CAC!$G$6:$G$53,B26,CAC!$F$6:$F$53)","v":1715889.3500000003}]
[null,"Prorrogação",{"$f":"COUNTIF(CAC!$G$6:$G$50,\"prorrogação\")","v":12},{"$f":"SUMIF(CAC!$G$6:$G$53,B27,CAC!$F$6:$F$53)","v":1006689.96}]
[null,"Dispensa",{"$f":"COUNTIF(CAC!$G$6:$G$50,\"Dispensa\")","v":15},{"$f":"SUMIF(CAC!$G$6:$G$53,B28,CAC!$F$6:$F$53)","v":154838}]
[null,"Inexigibilidade",{"$f":"COUNTIF(CAC!$G$6:$G$50,\"Inexigibilidade\")","v":3},{"$f":"SUMIF(CAC!$G$6:$G$53,B29,CAC!$F$6:$F$53)","v":367800}]
[]
[null,"Total",{"$f":"SUM(C26:C30)","v":45},{"$f":"SUM(D26:D30)","v":3245217.3100000005}]
[]
[]
[null,"Serviço"]
[]
[null,{"$f":"LEFT(CAC!B7,30)","v":"Serviços de manutenção prevent"}]