{"text_format":"1","workbook":"xlsx","n_sheets":7,"sheets":["INÍCIO","PAC","CAC","CAC - Acompanhamento","Orientações - uso das planilhas","Tabela temporalidade","Resumo_DADOS"],"not_rendered":{"charts":3,"images":0,"macros":0,"external_links":0,"defined_names":18,"comments":0,"pivot_tables":0},"unopened":[],"bounds":{"document_bytes":16777216,"sheet_cells":100000,"rows_first":2000,"rows_last":500,"rows_between":2000,"halvings":0,"cell_chars":16384,"cell_head_chars":4096},"cells_cut":0,"cells_raw":0,"read":"whole","date_system":"1900"}

{"sheet":"INÍCIO","index":0,"n_rows":0,"n_cols":0,"rows_kept":0,"cut":false,"hidden":true,"merged":[]}

{"sheet":"PAC","index":1,"n_rows":46,"n_cols":18,"rows_kept":46,"cut":false,"hidden":false,"merged":[]}
["1. Unidade requisitante\n(informar ID)","2. Descrição sucinta da demanda","3. Alinhamento da demanda com diretrizes e metas institucionais","4. Justificativa expressa para a contratação","Nº de itens","Descrição Geral","5. Código de item","Elemento de despesa","6. Quantidade total estimada e unidade de medida","7. Valor total estimado","8. Vinculação ou dependência, se houver, com a contratação de outro item para sua execução*","9. Data-limite para entrega dos bens ou início da prestação dos serviços*","10. Prazo previsto para a execução*","11. Objeto passível de contratação por  compra compartilhada?\n(sim/não)","12. Forma prevista para a contratação*\n(licitação, dispensa, inexigibilidade, prorrogação ou renovação)","13. Grau de prioridade","14. Critérios de sustentabilidade*","15. Riscos da não contratação"]
["SEVIT - 15317159","Lavagem de veículos para os veículos oficiais da Seção Judiciária de Roraima.","Alinha-se com disposições contidas na  IN-14-08 TRF1, Administração de Veículos, modulo manutenção e recuperação.","Limpeza, higienização dos veículos para preservar a saúde dos usuários.",6,"Lavagens e polimento dos veículos oficiais da frota da Seção Judiciária de Roraima.","00001354-4",null,20,2010,"NÃO","2023-03-01","10 meses","NÃO","Dispensa",3,"Utilização de produtos que agridam o meio-ambiente; Utilização de métodos que evitem o desperdício de água tratada, conforme Dec n. 48.138/2003.","Degradação do patrimônio; Insalubridade de operação."]
["SEVIT - 15317179","Serviços de manutenção preventiva e corretiva a serem executados nos veículos oficiais pertencentes à SJRR.","Alinha-se com as determinações estabelecidas nas Instruções Normativas nº 14-08 e 14-10 do TRF 1ª Região, bem como à Resolução nº 176/2013 do CNJ.","Dever da Administração de prestar o adequado serviço de manutenção dos bens que compõem o patrimônio público; e necessidade de garantir a segurança dos usuários.",1,"Serviço de manutenção preventiva / corretiva em veículos oficiais da SJRR","00000587-8",null,"45 H",6750,"NÃO","2023-03-30","9 meses","NÃO","Dispensa",3,"Destinação adequada de óleos lubrificantes para evitar contaminação do meio-ambiente.","Risco à segurança dos usuários; peralização de atividades que dependam do transporte com veículos; e degradação do patrimônio público."]
["SEVIT - 15317201","Fornecimento de combustíveis (gasolina comum, óleo diesel comum, óleo diesel S10 e etanol), destinados ao abastecimento dos veículos oficiais e do grupo gerador de energia elétrica da Justiça Federal de Primeira Instância - Seção Judiciária de Roraima","Alinha-se com as disposições contidas na  IN-14-08 TRF1, Administração de Veículos, modulo manutenção e recuperação.","Fornecimento dos meios necessários para o funcionamento dos veículos oficiais e grupo gerador.",4,"Comnustíveis - Gasolina, Diesel e Etanol","BR0016950; BR0016993; BR00150371",null,1500,8872,"NÃO","2023-04-30","12 meses","NÃO","Licitação",4,"Fornecedor deverá constar do Cadastro Técnico Federal de Atividades Potencialmente Poluidoras e Utilizadoras de Recursos Ambientais – CTF/APP","Paralização das atividades de transporte e impossibiliade de uso do Grupo Gerador em caso de falta de energia."]
["SEVIT - 15317489","Serviços de manutenção preventiva e corretiva de Porta Giratória Detector de Metais.","Alnha-se com as disposições contidas na  IN-14-08 TRF1, considerando a necessidade da Administração Pública de zelar pela segurança da SJRR através do controle de acesso de pessoas e materiais.","Manter a Porta Giratória - Detector de Metais  em perfeitas condições de uso.",2,"Manutenções preventivas e corretivas da porta giratória com detector de metais.","00001840-6",null,3,5500,"NÃO","2023-06-07","12 meses","NÃO","Prorrogação",3,null,"Aumento do risco à integridade das pessoas e do patrimônio público no âmbito da SJRR. "]
["SEVIT - 15342869","Serviços de seguro automotivo para os veículos oficiais que integram a frota da SJRR.","Alinha-se com as disposições contidas na  IN-14-08 TRF1, Administração de Veículos.","Necessidade de resguardar os veículos e seus condutores em eventuais ocorrências de danos e/ou de sinistros.",1,"Apólice de Seguros Automobilísticos.","00002276-4",null,1,7123,"NÃO","2023-06-07","12 meses","NÃO","Dispensa",3,"Observância da legislação atinente às melhores práticas de sustentabilidade ambiental no âmbito das contratações públicas.","Paralização de atividades essenciais, sucateamento de patrimônio público."]
["SEVIT - 15343725","Contratar ou firmar convênio com instituições de segurança pública, para realização de Curso de Treinamento de Tiro, para os servidores, Agentes da Polícia Judicial, aptos a portar arma de fogo da Seção Judiciária de Roraima.","Alinha-se com as disposições contidas no Art. 3 da RESOLUÇÃO N. 686/2020 - CJF, DE 15 DE DEZEMBRO DE 2020.","Considerando a obrigatoriedade da Administração Pública em prestar o adequado serviço de segurança e proteção a magistrados, servidores e jurisdicionados, bem como ao patrimônio público, torna-se necessário a contratação desses serviços.",1,"Curso de Treinamento de Tiro com Carga horária mínima de 4 horas com Certificado emitido contendo: carga horária, conteúdo programático, local, data de início término, assinatura do aluno e instrutor.",null,null,3,4500,"NÃO","2023-08-30","30 Dias","NÃO","Dispensa",3,"Descarte correto dos materiais empregados no curso","Desconformidade com a legislação"]
["SEVIT - 15344700","Serviços de vigilância armada e segurança patrimonial 24h, com postos nos principais locais de acesso do edifício-sede da Seção Judiciária de Roraima.","alinha-se com as determinações estabelecidas nas Instruções Normativas nº 14-08 e 14-10 do TRF 1ª Região, bem como à Resolução nº 176/2013 do CNJ.","Considerando a obrigatoriedade da Administração Pública em prestar o adequado serviço de segurança e proteção a magistrados, servidores e jurisdicionados, bem como ao patrimônio público.",3,"Vigilante diurno em turno de 12 x 36 horas; Vigilante noturno em turno de 12 x 36 horas e Vigilante diurno em turnos de 5 x 2 horas 44 horas semanais.","00002401-5",null,6,295269.36,"NÃO","2023-10-26","12 meses","NÃO","Prorrogação",4,"Promover ações educativas aos seus colaboradores sobre o consumo eficiente de energia elétrica e água","Entrada de pessoas não autorizadas ou objetos proibidos; vulnerabilidade do prédio a furtos e/ou vandalismo."]
{"$rows_left_out":39}
{"sheet":"CAC","index":2,"n_rows":53,"n_cols":32,"rows_kept":53,"cut":false,"hidden":false,"merged":[[1,2,1,28],[2,0,2,6],[3,12,3,14],[3,15,3,17],[3,22,4,22],[3,23,4,23],[3,28,4,28],[3,7,4,7],[3,8,4,8],[3,10,4,10],[3,0,4,0],[3,3,4,3],[3,2,4,2],[3,1,4,1],[3,5,4,5],[3,21,4,21],[3,6,4,6],[3,27,4,27],[2,7,2,21],[2,22,2,28],[3,20,4,20],[3,18,4,18],[3,11,4,11],[3,19,4,19],[3,9,4,9]]}
[null,null,"UG N°","ANO"]
[null,null,"CRONOGRAMA ANUAL DE EXECUÇÃO DAS CONTRATAÇÕES – CAC"]
["Dados do DOD",null,null,null,null,null,null,"Definição de Tempo das Etapas",null,null,null,null,null,null,null,null,null,null,null,null,null,null,"Datas Limites de Conclusão das Fases Intermediárias"]
["Unidade Requisitante\n(informar ID do DOD)","Objeto","PAE - SEI\n(informar nº do processo de contratação, quando autuado)","Data-limite para entrega dos bens ou início da prestação dos serviços",null,"Valor total estimado","Forma de Contratação","Contrato ou Nota de empenho?\n(C/N)","Seleção com Amostra?\n(S/N)","Qtd de Itens do Objeto","TApETP\n(dias)","TElabTR\n(dias)","Licitação",null,null,"Dispensa/inexigibilidade",null,null,"Prorrogação/  renovação","TElabCont/ NE\n(dias)","Recesso forense \n2021/22","TOTAL TEMPO DIAS","Dt entrega ETP","Dt entrega TR/PB","Aprovação do Termo de Referência \n(licitação)","Publicação do Edital\n(licitação)","Homologação do Resultado\n(licitação)","Procedimentos de prorrogação/ renovação","Dt Contratação"]
[null,null,null,null,"Prazo estimado para execução e pagamento total da despesa",null,null,null,null,null,null,null,"TApTR\n(dias)","TFILi\n(dias)","TFELi\n(dias)","TFICD\n(dias)","Instrução processual","Autorização da contratação",null,null,null,null,null,null,"Conclusão Fase Interna da Contratação Direta\n(disp./inexig.)","Despacho Instrução Processual \n(disp./inexig.)","Autorização da contratação \n(disp./inexig.)"]
[{"$f":"PAC!A2","v":"SEVIT - 15317159"},{"$f":"IFERROR(VLOOKUP(A6,PAC!$A$2:$R$4981,2,0),\"\")","v":"Lavagem de veículos para os veículos oficiais da Seção Judiciária de Roraima."},null,{"$f":"IFERROR(VLOOKUP(A6,PAC!$A$2:$R$4981,12,0),\"\")","v":"2023-03-01"},{"$f":"VLOOKUP(A6,PAC!$A$2:$R$4981,17,0)","v":"Utilização de produtos que agridam o meio-ambiente; Utilização de métodos que evitem o desperdício de água tratada, conforme Dec n. 48.138/2003."},{"$f":"IFERROR(VLOOKUP(A6,PAC!$A$2:$R$4981,10,0),\"\")","v":2010},{"$f":"IFERROR(VLOOKUP(A6,PAC!$A$2:$R$4981,15,0),\"\")","v":"Dispensa"},"C","N",{"$f":"SUMIF(PAC!$A$2:$A$4983,A6,PAC!$E$2:$E$4986)","v":6},{"$f":"IF(OR(G6=\"dispensa\",G6=\"inexigibilidade\",G6=\"licitação\"),15,\"0\")","v":15},{"$f":"IF(OR(G6=\"dispensa\",G6=\"inexigibilidade\",G6=\"licitação\"),10,\"0\")","v":10},{"$f":"IF(AND(G6=\"Licitação\"),IF(AND(H6=\"\"),0,IF(AND(H6=\"N\"),AE6,IF(AND(H6=\"C\"),AF6))),\"0\")","v":"0"},{"$f":"IF(AND(G6=\"Licitação\"),IF(AND(H6=\"\"),\"0\",IF(AND(H6=\"N\"),15,IF(AND(H6=\"C\"),25))),\"0\")","v":"0"},{"$f":"IF(AND(G6=\"Licitação\"),IF(AND(I6=\"\"),\"0\",IF(AND(I6=\"N\"),25,IF(AND(I6=\"S\"),40))),\"0\")","v":"0"},{"$f":"IF(OR(G6=\"dispensa\",G6=\"inexigibilidade\"),IF(AND(J6=0),0,IF(AND(J6>0,J6<11),35,IF(AND(J6>10,J6<21),45,IF(AND(J6>20),60)))),\"0\")","v":35},{"$f":"IF(OR(G6=\"dispensa\",G6=\"inexigibilidade\"),3,\"0\")","v":3},{"$f":"IF(OR(G6=\"dispensa\",G6=\"inexigibilidade\"),3,\"0\")","v":3},{"$f":"IF(OR(G6=\"prorrogação\",G6=\"renovação\"),60,\"0\")","v":"0"},{"$f":"IF(OR(G6=\"dispensa\",G6=\"inexigibilidade\",G6=\"licitação\"),IF(AND(H6=\"C\"),5,IF(AND(H6=\"N\"),3,IF(AND(H6=\"\"),\"0\"))),\"0\")","v":5},{"$f":"IF(D6>44549,18,\"0\")","v":18},{"$f":"SUM(K6:U6)","v":89},{"$f":"IF(AND($G6=\"licitação\"),$D6-$V6,IF(AND($G6=\"dispensa\"),$D6-$V6,IF(AND($G6=\"inexigibilidade\"),$D6-$V6,IF(AND($G6=\"renovação\"),\"---\",IF(AND($G6=\"prorrogação\"),\"---\",IF(AND($G6=\"\"),\"---\"))))))","v":"2022-12-02"},{"$f":"IF(AND($G6=\"licitação\"),$W6+$K6+$L6,IF(AND($G6=\"dispensa\"),$W6+$K6+$L6,IF(AND($G6=\"inexigibilidade\"),$W6+$K6+$L6,IF(AND($G6=\"renovação\"),\"---\",IF(AND($G6=\"prorrogação\"),\"---\",IF(AND($G6=\"\"),\"---\"))))))","v":"2022-12-27"},{"$f":"IF(AND($G6=\"licitação\"),$X6+$M6,IF(AND($G6=\"dispensa\"),$X6+$P6,IF(AND($G6=\"inexigibilidade\"),$X6+$P6,IF(AND($G6=\"prorrogação\"),\"---\",IF(AND($G6=\"renovação\"),\"---\",IF(AND($G6=\"\"),\"---\"))))))","v":"2023-01-31"},{"$f":"IF(AND($G6=\"licitação\"),$Y6+$N6,IF(AND($G6=\"dispensa\"),$Y6+$Q6,IF(AND($G6=\"inexigibilidade\"),$Y6+$Q6,IF(AND($G6=\"prorrogação\"),\"---\",IF(AND($G6=\"renovação\"),\"---\",IF(AND($G6=\"\"),\"---\"))))))","v":"2023-02-03"},{"$f":"IF(AND($G6=\"licitação\"),$Z6+$O6,IF(AND($G6=\"dispensa\"),$Z6+$R6,IF(AND($G6=\"inexigibilidade\"),$Z6+$R6,IF(AND($G6=\"prorrogação\"),\"---\",IF(AND($G6=\"renovação\"),\"---\",IF(AND($G6=\"\"),\"---\"))))))","v":"2023-02-06"},{"$f":"IF(AND($G6=\"licitação\"),\"---\",IF(AND($G6=\"dispensa\"),\"---\",IF(AND($G6=\"inexigibilidade\"),\"---\",IF(AND($G6=\"renovação\"),$D6-$V6,IF(AND($G6=\"prorrogação\"),$D6-$V6,IF(AND($G6=\"\"),\"---\"))))))","v":"---"},{"$f":"IF(AND($G6=\"licitação\"),AA6+T6,IF(AND($G6=\"dispensa\"),AA6+T6,IF(AND($G6=\"inexigibilidade\"),AA6+T6,IF(AND($G6=\"renovação\"),$AB6+$S6,IF(AND($G6=\"prorrogação\"),$AB6+$S6,IF(AND($G6=\"\"),\"---\"))))))","v":"2023-02-11"},{"$f":"IFERROR(IF(OR(G6=\"dispensa\",G6=\"inexigibilidade\",G6=\"licitação\"),IF(AND(W6<44568,AC6>44549),\"Atenção!Há recesso forense no período! Fazer ajuste manual de datas, se for o caso.\",\"\"),IF(OR(G6=\"prorrogação\",G6=\"renovação\"),(IF(AND(AB6<44568,AC6>44549),\"Atenção!Há recesso forense no período! Fazer ajuste manual de datas, se for o caso.\")),\"\")),\"\")","v":""},{"$f":"IF(AND(H6=\"N\",J6=1),20,IF(AND(H6=\"N\",J6>1,J6<6),30,IF(AND(H6=\"N\",J6>5,J6<16),45,IF(AND(H6=\"N\",J6>15),70))))","v":false},{"$f":"IF(AND(H6=\"C\",J6=1),40,IF(AND(H6=\"C\",J6>1,J6<6),50,IF(AND(H6=\"C\",J6>5,J6<16),75,IF(AND(H6=\"C\",J6>15),100))))","v":75}]
[{"$f":"PAC!A3","v":"SEVIT - 15317179"},{"$f":"IFERROR(VLOOKUP(A7,PAC!$A$2:$R$4981,2,0),\"\")","v":"Serviços de manutenção preventiva e corretiva a serem executados nos veículos oficiais pertencentes à SJRR."},null,{"$f":"IFERROR(VLOOKUP(A7,PAC!$A$2:$R$4981,12,0),\"\")","v":"2023-03-30"},{"$f":"VLOOKUP(A7,PAC!$A$2:$R$4981,17,0)","v":"Destinação adequada de óleos lubrificantes para evitar contaminação do meio-ambiente."},{"$f":"IFERROR(VLOOKUP(A7,PAC!$A$2:$R$4981,10,0),\"\")","v":6750},{"$f":"IFERROR(VLOOKUP(A7,PAC!$A$2:$R$4981,15,0),\"\")","v":"Dispensa"},"C","N",{"$f":"SUMIF(PAC!$A$2:$A$4983,A7,PAC!$E$2:$E$4986)","v":1},{"$f":"IF(OR(G7=\"dispensa\",G7=\"inexigibilidade\",G7=\"licitação\"),15,\"0\")","v":15},{"$f":"IF(OR(G7=\"dispensa\",G7=\"inexigibilidade\",G7=\"licitação\"),10,\"0\")","v":10},{"$f":"IF(AND(G7=\"Licitação\"),IF(AND(H7=\"\"),0,IF(AND(H7=\"N\"),AE7,IF(AND(H7=\"C\"),AF7))),\"0\")","v":"0"},{"$f":"IF(AND(G7=\"Licitação\"),IF(AND(H7=\"\"),\"0\",IF(AND(H7=\"N\"),15,IF(AND(H7=\"C\"),25))),\"0\")","v":"0"},"0",35,3,3,"0",5,18,89,{"$f":"IF(AND($G7=\"licitação\"),$D7-$V7,IF(AND($G7=\"dispensa\"),$D7-$V7,IF(AND($G7=\"inexigibilidade\"),$D7-$V7,IF(AND($G7=\"renovação\"),\"---\",IF(AND($G7=\"prorrogação\"),\"---\",IF(AND($G7=\"\"),\"---\"))))))","v":"2022-12-31"},{"$f":"IF(AND($G7=\"licitação\"),$W7+$K7+$L7,IF(AND($G7=\"dispensa\"),$W7+$K7+$L7,IF(AND($G7=\"inexigibilidade\"),$W7+$K7+$L7,IF(AND($G7=\"renovação\"),\"---\",IF(AND($G7=\"prorrogação\"),\"---\",IF(AND($G7=\"\"),\"---\"))))))","v":"2023-01-25"},{"$f":"IF(AND($G7=\"licitação\"),$X7+$M7,IF(AND($G7=\"dispensa\"),$X7+$P7,IF(AND($G7=\"inexigibilidade\"),$X7+$P7,IF(AND($G7=\"prorrogação\"),\"---\",IF(AND($G7=\"renovação\"),\"---\",IF(AND($G7=\"\"),\"---\"))))))","v":"2023-03-01"},{"$f":"IF(AND($G7=\"licitação\"),$Y7+$N7,IF(AND($G7=\"dispensa\"),$Y7+$Q7,IF(AND($G7=\"inexigibilidade\"),$Y7+$Q7,IF(AND($G7=\"prorrogação\"),\"---\",IF(AND($G7=\"renovação\"),\"---\",IF(AND($G7=\"\"),\"---\"))))))","v":"2023-03-04"},{"$f":"IF(AND($G7=\"licitação\"),$Z7+$O7,IF(AND($G7=\"dispensa\"),$Z7+$R7,IF(AND($G7=\"inexigibilidade\"),$Z7+$R7,IF(AND($G7=\"prorrogação\"),\"---\",IF(AND($G7=\"renovação\"),\"---\",IF(AND($G7=\"\"),\"---\"))))))","v":"2023-03-07"},{"$f":"IF(AND($G7=\"licitação\"),\"---\",IF(AND($G7=\"dispensa\"),\"---\",IF(AND($G7=\"inexigibilidade\"),\"---\",IF(AND($G7=\"renovação\"),$D7-$V7,IF(AND($G7=\"prorrogação\"),$D7-$V7,IF(AND($G7=\"\"),\"---\"))))))","v":"---"},"2023-03-12","",false,40]
[{"$f":"PAC!A4","v":"SEVIT - 15317201"},{"$f":"IFERROR(VLOOKUP(A8,PAC!$A$2:$R$4981,2,0),\"\")","v":"Fornecimento de combustíveis (gasolina comum, óleo diesel comum, óleo diesel S10 e etanol), destinados ao abastecimento dos veículos oficiais e do grupo gerador de energia elétrica da Justiça Federal de Primeira Instância - Seção Judiciária de Roraima"},null,{"$f":"IFERROR(VLOOKUP(A8,PAC!$A$2:$R$4981,12,0),\"\")","v":"2023-04-30"},{"$f":"VLOOKUP(A8,PAC!$A$2:$R$4981,17,0)","v":"Fornecedor deverá constar do Cadastro Técnico Federal de Atividades Potencialmente Poluidoras e Utilizadoras de Recursos Ambientais – CTF/APP"},{"$f":"IFERROR(VLOOKUP(A8,PAC!$A$2:$R$4981,10,0),\"\")","v":8872},{"$f":"IFERROR(VLOOKUP(A8,PAC!$A$2:$R$4981,15,0),\"\")","v":"Licitação"},"C","N",{"$f":"SUMIF(PAC!$A$2:$A$4983,A8,PAC!$E$2:$E$4986)","v":4},15,10,50,25,25,"0","0","0","0",5,18,148,{"$f":"IF(AND($G8=\"licitação\"),$D8-$V8,IF(AND($G8=\"dispensa\"),$D8-$V8,IF(AND($G8=\"inexigibilidade\"),$D8-$V8,IF(AND($G8=\"renovação\"),\"---\",IF(AND($G8=\"prorrogação\"),\"---\",IF(AND($G8=\"\"),\"---\"))))))","v":"2022-12-03"},{"$f":"IF(AND($G8=\"licitação\"),$W8+$K8+$L8,IF(AND($G8=\"dispensa\"),$W8+$K8+$L8,IF(AND($G8=\"inexigibilidade\"),$W8+$K8+$L8,IF(AND($G8=\"renovação\"),\"---\",IF(AND($G8=\"prorrogação\"),\"---\",IF(AND($G8=\"\"),\"---\"))))))","v":"2022-12-28"},{"$f":"IF(AND($G8=\"licitação\"),$X8+$M8,IF(AND($G8=\"dispensa\"),$X8+$P8,IF(AND($G8=\"inexigibilidade\"),$X8+$P8,IF(AND($G8=\"prorrogação\"),\"---\",IF(AND($G8=\"renovação\"),\"---\",IF(AND($G8=\"\"),\"---\"))))))","v":"2023-02-16"},{"$f":"IF(AND($G8=\"licitação\"),$Y8+$N8,IF(AND($G8=\"dispensa\"),$Y8+$Q8,IF(AND($G8=\"inexigibilidade\"),$Y8+$Q8,IF(AND($G8=\"prorrogação\"),\"---\",IF(AND($G8=\"renovação\"),\"---\",IF(AND($G8=\"\"),\"---\"))))))","v":"2023-03-13"},{"$f":"IF(AND($G8=\"licitação\"),$Z8+$O8,IF(AND($G8=\"dispensa\"),$Z8+$R8,IF(AND($G8=\"inexigibilidade\"),$Z8+$R8,IF(AND($G8=\"prorrogação\"),\"---\",IF(AND($G8=\"renovação\"),\"---\",IF(AND($G8=\"\"),\"---\"))))))","v":"2023-04-07"},{"$f":"IF(AND($G8=\"licitação\"),\"---\",IF(AND($G8=\"dispensa\"),\"---\",IF(AND($G8=\"inexigibilidade\"),\"---\",IF(AND($G8=\"renovação\"),$D8-$V8,IF(AND($G8=\"prorrogação\"),$D8-$V8,IF(AND($G8=\"\"),\"---\"))))))","v":"---"},"2023-04-12","",false,50]
{"$rows_left_out":46}
{"sheet":"CAC - Acompanhamento","index":3,"n_rows":300,"n_cols":16,"rows_kept":300,"cut":false,"hidden":false,"merged":[]}
["ID","PA-SEI","Objeto","Qtd dias para a contratação","Data estimada\nETP","Data estimada\nTR/PB","Data estimada\nRenovação/ Prorrogação","Data estimada\nContratação","Data efetiva entrega \nETP","Dt efetiva entrega\nTR/PB","Dt início procedimentos de prorrogação/ renovação","Dt efetiva Contratação","stat_ETP","stat_TR/PB","stat_renov/ prorrog","stat_cont"]
[{"$f":"CAC!A6","v":"SEVIT - 15317159"},{"$f":"CAC!C6","v":0},{"$f":"CAC!B6","v":"Lavagem de veículos para os veículos oficiais da Seção Judiciária de Roraima."},{"$f":"H2-TODAY()","v":109},{"$f":"CAC!W6","v":"2022-12-02"},{"$f":"CAC!X6","v":"2022-12-27"},{"$f":"CAC!AB6","v":"---"},{"$f":"CAC!AC6","v":"2023-02-11"},null,null,null,null,{"$f":"IF(E2=\"---\",\"N/A\",IF(AND(I2=\"\",NOW()-E2<0),\"Em dia\",IF(AND(I2=\"\",NOW()-E2>0),\"Pendência\",IF(I2>E2,\"Entregue com atraso\",\"Entregue\"))))","v":"Em dia"},{"$f":"IF(F2=\"---\",\"N/A\",IF(AND(J2=\"\",NOW()-F2<0),\"Em dia\",IF(AND(J2=\"\",NOW()-F2>0),\"Pendência\",IF(J2>F2,\"Entregue com atraso\",\"Entregue\"))))","v":"Em dia"},{"$f":"IF(G2=\"---\",\"N/A\",IF(AND(K2=\"\",NOW()-G2<0),\"Em dia\",IF(AND(K2=\"\",NOW()-G2>0),\"Pendência\",IF(K2>G2,\"Contratado com atraso\",\"Contratado\"))))","v":"N/A"},{"$f":"IF(AND(L2=\"\",NOW()-H2<0),\"Em dia\",IF(AND(L2=\"\",NOW()-H2>0),\"Pendência\",IF(L2>H2,\"Contratado com atraso\",\"Contratado\")))","v":"Em dia"}]
[{"$f":"CAC!A7","v":"SEVIT - 15317179"},{"$f":"CAC!C7","v":0},{"$f":"CAC!B7","v":"Serviços de manutenção preventiva e corretiva a serem executados nos veículos oficiais pertencentes à SJRR."},{"$f":"H3-TODAY()","v":138},{"$f":"CAC!W7","v":"2022-12-31"},{"$f":"CAC!X7","v":"2023-01-25"},{"$f":"CAC!AB7","v":"---"},{"$f":"CAC!AC7","v":"2023-03-12"},null,null,null,null,{"$f":"IF(E3=\"---\",\"N/A\",IF(AND(I3=\"\",NOW()-E3<0),\"Em dia\",IF(AND(I3=\"\",NOW()-E3>0),\"Pendência\",IF(I3>E3,\"Entregue com atraso\",\"Entregue\"))))","v":"Em dia"},{"$f":"IF(F3=\"---\",\"N/A\",IF(AND(J3=\"\",NOW()-F3<0),\"Em dia\",IF(AND(J3=\"\",NOW()-F3>0),\"Pendência\",IF(J3>F3,\"Entregue com atraso\",\"Entregue\"))))","v":"Em dia"},{"$f":"IF(G3=\"---\",\"N/A\",IF(AND(K3=\"\",NOW()-G3<0),\"Em dia\",IF(AND(K3=\"\",NOW()-G3>0),\"Pendência\",IF(K3>G3,\"Contratado com atraso\",\"Contratado\"))))","v":"N/A"},{"$f":"IF(AND(L3=\"\",NOW()-H3<0),\"Em dia\",IF(AND(L3=\"\",NOW()-H3>0),\"Pendência\",IF(L3>H3,\"Contratado com atraso\",\"Contratado\")))","v":"Em dia"}]
[{"$f":"CAC!A8","v":"SEVIT - 15317201"},{"$f":"CAC!C8","v":0},{"$f":"CAC!B8","v":"Fornecimento de combustíveis (gasolina comum, óleo diesel comum, óleo diesel S10 e etanol), destinados ao abastecimento dos veículos oficiais e do grupo gerador de energia elétrica da Justiça Federal de Primeira Instância - Seção Judiciária de Roraima"},169,{"$f":"CAC!W8","v":"2022-12-03"},{"$f":"CAC!X8","v":"2022-12-28"},{"$f":"CAC!AB8","v":"---"},{"$f":"CAC!AC8","v":"2023-04-12"},null,null,null,null,"Em dia","Em dia","N/A","Em dia"]
[{"$f":"CAC!A9","v":"SEVIT - 15317489"},{"$f":"CAC!C9","v":0},{"$f":"CAC!B9","v":"Serviços de manutenção preventiva e corretiva de Porta Giratória Detector de Metais."},207,{"$f":"CAC!W9","v":"---"},{"$f":"CAC!X9","v":"---"},{"$f":"CAC!AB9","v":"2023-03-21"},{"$f":"CAC!AC9","v":"2023-05-20"},null,null,null,null,"N/A","N/A","Em dia","Em dia"]
[{"$f":"CAC!A10","v":"SEVIT - 15342869"},{"$f":"CAC!C10","v":0},{"$f":"CAC!B10","v":"Serviços de seguro automotivo para os veículos oficiais que integram a frota da SJRR."},207,{"$f":"CAC!W10","v":"2023-03-10"},{"$f":"CAC!X10","v":"2023-04-04"},{"$f":"CAC!AB10","v":"---"},{"$f":"CAC!AC10","v":"2023-05-20"},null,null,null,null,"Em dia","Em dia","N/A","Em dia"]
[{"$f":"CAC!A11","v":"SEVIT - 15343725"},{"$f":"CAC!C11","v":0},{"$f":"CAC!B11","v":"Contratar ou firmar convênio com instituições de segurança pública, para realização de Curso de Treinamento de Tiro, para os servidores, Agentes da Polícia Judicial, aptos a portar arma de fogo da Seção Judiciária de Roraima."},291,{"$f":"CAC!W11","v":"2023-06-02"},{"$f":"CAC!X11","v":"2023-06-27"},{"$f":"CAC!AB11","v":"---"},{"$f":"CAC!AC11","v":"2023-08-12"},null,null,null,null,"Em dia","Em dia","N/A","Em dia"]
[{"$f":"CAC!A12","v":"SEVIT - 15344700"},{"$f":"CAC!C12","v":0},{"$f":"CAC!B12","v":"Serviços de vigilância armada e segurança patrimonial 24h, com postos nos principais locais de acesso do edifício-sede da Seção Judiciária de Roraima."},348,{"$f":"CAC!W12","v":"---"},{"$f":"CAC!X12","v":"---"},{"$f":"CAC!AB12","v":"2023-08-09"},{"$f":"CAC!AC12","v":"2023-10-08"},null,null,null,null,"N/A","N/A","Em dia","Em dia"]
{"$rows_left_out":293}
{"sheet":"Orientações - uso das planilhas","index":4,"n_rows":14,"n_cols":2,"rows_kept":14,"cut":false,"hidden":false,"merged":[[9,1,9,12],[10,1,10,12],[1,1,1,12],[13,1,13,12],[2,0,3,0],[2,1,2,12],[3,1,3,12],[4,1,4,12],[5,1,5,12],[6,1,6,12]]}
["Planilha PAC"]
["Preenchimento de dados:","Todas as colunas deverão ser preenchidas pelo usuário;"]
["DOD com mais de 1 item:","O ID deverá ser mencionado em cada linha correspondente a cada item, para permitir adequada utilização da ferramenta de filtro;"]
[null,"Quando houver mais de um item por DOD, deverá ser informado um item por linha, para permitir adequada visualização e contabilização de dados nas planilhas PAC e CAC;"]
["Coluna A:","Quando o ID tiver de ser mencionado em mais de uma linha (DODs com mais de 1 item), não mesclar as respectivas células de modo a permitir a adequada utilização da ferramenta de filtro;"]
["Colunas E, F, G, H, I, J, K, L, M:","Em DODs com mais de 1 item, informar um item para cada linha. Não mesclar as respectivas células de modo a permitir a adequada visualização e contabilização de dados nas planilhas PAC e CAC;"]
["Coluna W (após coluna V - Riscos da não contratação):","Informar o algarismo \"1\" para cada linha que houver item informado. Isso é necessário para contabilizar corretamente a quantidade de itens na planilha CAC, coluna J - \"Qtd de Itens do Objeto\";"]
[]
{"$rows_left_out":7}
{"sheet":"Tabela temporalidade","index":5,"n_rows":26,"n_cols":9,"rows_kept":26,"cut":false,"hidden":false,"merged":[[25,1,25,6],[24,1,24,6],[23,1,23,6],[22,1,22,6],[21,1,21,6],[20,1,20,6],[19,1,19,6],[1,1,1,2],[0,0,0,3],[0,5,0,8],[1,6,1,7]]}
["LICITAÇÃO",null,null,null,null,"DISPENSA E INEXIGIBILIDADE"]
["Etapa","Definidores do Tempo",null,"Tempo (dias)",null,"Etapa","Definidores do Tempo",null,"Tempo (dias)"]
["TApETP","---","---",15,null,"TApETP","---","---",15]
["TElabTR","---","---",10,null,"TElabTR","---","---",10]
["TApTR","sem contrato","1 item",20,null,"TFICD","com ou sem contrato","1 a 10 itens",35]
["TApTR","sem contrato","2 a 5 itens",30,null,"TFICD","com ou sem contrato","11 a 20 itens",45]
["TApTR","sem contrato","6 a 15 itens",45,null,"TFICD","com ou sem contrato","21 ou + itens",60]
["TApTR","sem contrato","16 ou + itens",70,null,"Instrução processual","---","---",3]
{"$rows_left_out":19}
{"sheet":"Resumo_DADOS","index":6,"n_rows":36,"n_cols":4,"rows_kept":36,"cut":false,"hidden":false,"merged":[]}
[]
[null,"Unidade","Demandas","Estimado"]
[null,"SESEG",{"$f":"COUNTIF(CAC!$A$6:$A$47,\"SESEG*\")","v":18},{"$f":"SUMIF(CAC!$A$6:$A$53,B3&\"*\",CAC!$F$6:$F$53)","v":1765174.9200000002}]
[null,"SEMAP",{"$f":"COUNTIF(CAC!$A$6:$A$47,\"SEMAP*\")","v":1},{"$f":"SUMIF(CAC!$A$6:$A$53,B4&\"*\",CAC!$F$6:$F$53)","v":52505}]
[null,"SEVIT",{"$f":"COUNTIF(CAC!$A$6:$A$47,\"sevit*\")","v":11},{"$f":"SUMIF(CAC!$A$6:$A$53,B5&\"*\",CAC!$F$6:$F$53)","v":348814.36}]
[null,"SEINF",{"$f":"COUNTIF(CAC!$A$6:$A$47,\"seinf*\")","v":1},{"$f":"SUMIF(CAC!$A$6:$A$53,B6&\"*\",CAC!$F$6:$F$53)","v":472680}]
[null,"SEBES",{"$f":"COUNTIF(CAC!$A$6:$A$47,\"sebes*\")","v":4},{"$f":"SUMIF(CAC!$A$6:$A$53,B7&\"*\",CAC!$F$6:$F$53)","v":343720.14999999997}]
[null,"SECAM",{"$f":"COUNTIF(CAC!$A$6:$A$47,\"SECAM*\")","v":5},{"$f":"SUMIF(CAC!$A$6:$A$53,B8&\"*\",CAC!$F$6:$F$53)","v":91457.88}]
{"$rows_left_out":28}